this derivation will be built: /nix/store/1fr943g8ddxk2fppyvgkck857mar8k04-run-check-harness-psql-15-slim.drv these 2 paths will be fetched (23.3 KiB download, 92.5 KiB unpacked): /nix/store/11dikpp94v9jaclp9f5gmqmpavyaj654-postgres-15-check-harness /nix/store/03wnzmq8rdb486z9jhvpa3v61abj6zzl-start-postgres-server-test error: Cannot build '/nix/store/1fr943g8ddxk2fppyvgkck857mar8k04-run-check-harness-psql-15-slim.drv'. Reason: builder failed with exit code 1. Output paths: /nix/store/fh5d1wqadsw6jp4z87vl0ml6fifn40dp-run-check-harness-psql-15-slim Last 25 log lines: > test supautils_restrict_versions ... ok 85 ms > test vault ... ok 29 ms > test wal2json ... ok 14 ms > test z_15_ext_interface ... FAILED 627 ms > test z_15_intarray_ltree_query ... ok 13 ms > test z_15_pg_stat_monitor ... ok 12 ms > test z_15_pgjwt ... ok 20 ms > test z_15_pgvector ... ok 36 ms > test z_15_plv8 ... ok 51 ms > test z_15_roles ... ok 17 ms > test z_15_rum ... ok 18 ms > test z_15_timescale ... ok 22 ms > test z_15_unhype_timescale_to_partman ... ok 11956 ms > > ======================= > 2 of 72 tests failed. > ======================= > > The differences that caused some tests to fail can be viewed in the > file "/nix/store/fh5d1wqadsw6jp4z87vl0ml6fifn40dp-run-check-harness-psql-15-slim/regression_output/regression.diffs". A copy of the test summary that you see > above is saved in the file "/nix/store/fh5d1wqadsw6jp4z87vl0ml6fifn40dp-run-check-harness-psql-15-slim/regression_output/regression.out". > > 2026-10-07 21:55:08 [ERROR] pg_regress tests failed > 2026-10-07 21:55:08 [ERROR] An error occurred. Exit code: 1 > 2026-10-07 21:55:09 [ERROR] Debug logs: For full logs, run: nix log /nix/store/1fr943g8ddxk2fppyvgkck857mar8k04-run-check-harness-psql-15-slim.drv