nixbot

builds
1this derivation will be built:2 /nix/store/c5an85xfd89yv0hp2wyrmknx9br8wcqy-run-check-harness-psql-17.drv3these 2 paths will be fetched (23.2 KiB download, 91.8 KiB unpacked):4 /nix/store/lbnc9h9pp6rfdw3h4jx30hb99b91k0ss-postgres-17-check-harness5 /nix/store/psza5bjc0x9jfx8jkbv83ih43i2g7rq4-start-postgres-server-test6error: Cannot build '/nix/store/c5an85xfd89yv0hp2wyrmknx9br8wcqy-run-check-harness-psql-17.drv'.7 Reason: builder failed with exit code 1.8 Output paths:9 /nix/store/qfpkjv3w44hbn0ih7yc1naaaykqjlgag-run-check-harness-psql-1710 Last 25 log lines:11 > test roles ... ok 14 ms12 > test security ... ok 11 ms13 > test storage ... ok 16 ms14 > test supautils_reserved_roles ... ok 10 ms15 > test supautils_restrict_versions ... ok 94 ms16 > test vault ... ok 33 ms17 > test wal2json ... ok 15 ms18 > test z_17_ext_interface ... FAILED 141 ms19 > test z_17_intarray_ltree_query ... ok 15 ms20 > test z_17_pg_stat_monitor ... ok 8 ms21 > test z_17_pgvector ... ok 19 ms22 > test z_17_roles ... ok 18 ms23 > test z_17_rum ... ok 17 ms24 >25 > =======================26 > 2 of 68 tests failed.27 > =======================28 >29 > The differences that caused some tests to fail can be viewed in the30 > file "/nix/store/qfpkjv3w44hbn0ih7yc1naaaykqjlgag-run-check-harness-psql-17/regression_output/regression.diffs". A copy of the test summary that you see31 > above is saved in the file "/nix/store/qfpkjv3w44hbn0ih7yc1naaaykqjlgag-run-check-harness-psql-17/regression_output/regression.out".32 >33 > 2026-10-07 19:30:53 [ERROR] pg_regress tests failed34 > 2026-10-07 19:30:53 [ERROR] An error occurred. Exit code: 135 > 2026-10-07 19:30:53 [ERROR] Debug logs:36 For full logs, run:37 nix log /nix/store/c5an85xfd89yv0hp2wyrmknx9br8wcqy-run-check-harness-psql-17.drv