nixbot

builds

supabase/postgres build #159 failed

branch develop · PR #2531 · commit 8c610d3397 · · took 32m 58s · eval 8m 15s

12 failed
failed attributes
status attribute duration
failed checks.aarch64-linux.psql_15 1m 39s
run-check-harness-psql-15: 2 of 72 tests failed. ======================= The differences that caused some tests to fail can be viewed in the file "/nix/store/ …
run-check-harness-psql-15:
 2 of 72 tests failed. 
=======================
The differences that caused some tests to fail can be viewed in the
file "/nix/store/4gzz724vmqm8lswcpdhfmwksmjpwkwym-run-check-harness-psql-15/regression_output/regression.diffs".  A copy of the test summary that you see
above is saved in the file "/nix/store/4gzz724vmqm8lswcpdhfmwksmjpwkwym-run-check-harness-psql-15/regression_output/regression.out".
2026-10-07 19:29:33 [ERROR] pg_regress tests failed
2026-10-07 19:29:33 [ERROR] An error occurred. Exit code: 1
2026-10-07 19:29:34 [ERROR] Debug logs:
failed checks.aarch64-linux.psql_15_slim 1m 39s
run-check-harness-psql-15-slim: 2 of 72 tests failed. ======================= The differences that caused some tests to fail can be viewed in the file "/nix/s …
run-check-harness-psql-15-slim:
 2 of 72 tests failed. 
=======================
The differences that caused some tests to fail can be viewed in the
file "/nix/store/ybyxp22rqvyklbpbfbwa4kh6y7zsaymg-run-check-harness-psql-15-slim/regression_output/regression.diffs".  A copy of the test summary that you see
above is saved in the file "/nix/store/ybyxp22rqvyklbpbfbwa4kh6y7zsaymg-run-check-harness-psql-15-slim/regression_output/regression.out".
2026-10-07 19:29:33 [ERROR] pg_regress tests failed
2026-10-07 19:29:33 [ERROR] An error occurred. Exit code: 1
2026-10-07 19:29:33 [ERROR] Debug logs:
failed checks.aarch64-linux.psql_17 52s
run-check-harness-psql-17: 2 of 68 tests failed. ======================= The differences that caused some tests to fail can be viewed in the file "/nix/store/ …
run-check-harness-psql-17:
 2 of 68 tests failed. 
=======================
The differences that caused some tests to fail can be viewed in the
file "/nix/store/0dpm784n0bnkicbj1q05pjflw6flvv2h-run-check-harness-psql-17/regression_output/regression.diffs".  A copy of the test summary that you see
above is saved in the file "/nix/store/0dpm784n0bnkicbj1q05pjflw6flvv2h-run-check-harness-psql-17/regression_output/regression.out".
2026-10-07 19:28:46 [ERROR] pg_regress tests failed
2026-10-07 19:28:46 [ERROR] An error occurred. Exit code: 1
2026-10-07 19:28:46 [ERROR] Debug logs:
failed checks.aarch64-linux.psql_17_slim 52s
run-check-harness-psql-17-slim: 2 of 68 tests failed. ======================= The differences that caused some tests to fail can be viewed in the file "/nix/s …
run-check-harness-psql-17-slim:
 2 of 68 tests failed. 
=======================
The differences that caused some tests to fail can be viewed in the
file "/nix/store/0r6s6ilzkirk31ky4dlg3xz5m2p266ss-run-check-harness-psql-17-slim/regression_output/regression.diffs".  A copy of the test summary that you see
above is saved in the file "/nix/store/0r6s6ilzkirk31ky4dlg3xz5m2p266ss-run-check-harness-psql-17-slim/regression_output/regression.out".
2026-10-07 19:28:46 [ERROR] pg_regress tests failed
2026-10-07 19:28:46 [ERROR] An error occurred. Exit code: 1
2026-10-07 19:28:46 [ERROR] Debug logs:
failed checks.aarch64-linux.psql_orioledb-17 54s
run-check-harness-psql-orioledb-17: 2 of 65 tests failed. ======================= The differences that caused some tests to fail can be viewed in the file "/n …
run-check-harness-psql-orioledb-17:
 2 of 65 tests failed. 
=======================
The differences that caused some tests to fail can be viewed in the
file "/nix/store/blr0r306gwr38y1ywza14gi78kdbv9lx-run-check-harness-psql-orioledb-17/regression_output/regression.diffs".  A copy of the test summary that you see
above is saved in the file "/nix/store/blr0r306gwr38y1ywza14gi78kdbv9lx-run-check-harness-psql-orioledb-17/regression_output/regression.out".
2026-10-07 19:28:48 [ERROR] pg_regress tests failed
2026-10-07 19:28:48 [ERROR] An error occurred. Exit code: 1
2026-10-07 19:28:48 [ERROR] Debug logs:
failed checks.aarch64-linux.psql_orioledb-17_slim 54s
run-check-harness-psql-orioledb-17-slim: 2 of 65 tests failed. ======================= The differences that caused some tests to fail can be viewed in the fil …
run-check-harness-psql-orioledb-17-slim:
 2 of 65 tests failed. 
=======================
The differences that caused some tests to fail can be viewed in the
file "/nix/store/v21xqy81ki6xg73yka59s2prb4z5lhkm-run-check-harness-psql-orioledb-17-slim/regression_output/regression.diffs".  A copy of the test summary that you see
above is saved in the file "/nix/store/v21xqy81ki6xg73yka59s2prb4z5lhkm-run-check-harness-psql-orioledb-17-slim/regression_output/regression.out".
2026-10-07 19:28:48 [ERROR] pg_regress tests failed
2026-10-07 19:28:48 [ERROR] An error occurred. Exit code: 1
2026-10-07 19:28:48 [ERROR] Debug logs:
failed checks.x86_64-linux.psql_15 1m 6s
run-check-harness-psql-15: 2 of 72 tests failed. ======================= The differences that caused some tests to fail can be viewed in the file "/nix/store/ …
run-check-harness-psql-15:
 2 of 72 tests failed. 
=======================
The differences that caused some tests to fail can be viewed in the
file "/nix/store/gl4i4yvfawa1ds8wa0cljph7pdfjngwv-run-check-harness-psql-15/regression_output/regression.diffs".  A copy of the test summary that you see
above is saved in the file "/nix/store/gl4i4yvfawa1ds8wa0cljph7pdfjngwv-run-check-harness-psql-15/regression_output/regression.out".
2026-10-07 19:31:24 [ERROR] pg_regress tests failed
2026-10-07 19:31:24 [ERROR] An error occurred. Exit code: 1
2026-10-07 19:31:24 [ERROR] Debug logs:
failed checks.x86_64-linux.psql_15_slim 1m 6s
run-check-harness-psql-15-slim: 2 of 72 tests failed. ======================= The differences that caused some tests to fail can be viewed in the file "/nix/s …
run-check-harness-psql-15-slim:
 2 of 72 tests failed. 
=======================
The differences that caused some tests to fail can be viewed in the
file "/nix/store/5z312n1r4br983hqzb7ffvj2mdm5c7hi-run-check-harness-psql-15-slim/regression_output/regression.diffs".  A copy of the test summary that you see
above is saved in the file "/nix/store/5z312n1r4br983hqzb7ffvj2mdm5c7hi-run-check-harness-psql-15-slim/regression_output/regression.out".
2026-10-07 19:31:24 [ERROR] pg_regress tests failed
2026-10-07 19:31:24 [ERROR] An error occurred. Exit code: 1
2026-10-07 19:31:24 [ERROR] Debug logs:
failed checks.x86_64-linux.psql_17 35s
run-check-harness-psql-17: 2 of 68 tests failed. ======================= The differences that caused some tests to fail can be viewed in the file "/nix/store/ …
run-check-harness-psql-17:
 2 of 68 tests failed. 
=======================
The differences that caused some tests to fail can be viewed in the
file "/nix/store/qfpkjv3w44hbn0ih7yc1naaaykqjlgag-run-check-harness-psql-17/regression_output/regression.diffs".  A copy of the test summary that you see
above is saved in the file "/nix/store/qfpkjv3w44hbn0ih7yc1naaaykqjlgag-run-check-harness-psql-17/regression_output/regression.out".
2026-10-07 19:30:53 [ERROR] pg_regress tests failed
2026-10-07 19:30:53 [ERROR] An error occurred. Exit code: 1
2026-10-07 19:30:53 [ERROR] Debug logs:
failed checks.x86_64-linux.psql_17_slim 36s
run-check-harness-psql-17-slim: 2 of 68 tests failed. ======================= The differences that caused some tests to fail can be viewed in the file "/nix/s …
run-check-harness-psql-17-slim:
 2 of 68 tests failed. 
=======================
The differences that caused some tests to fail can be viewed in the
file "/nix/store/kiqb52klbpd9i10q0nnqvmidbxzc1a1j-run-check-harness-psql-17-slim/regression_output/regression.diffs".  A copy of the test summary that you see
above is saved in the file "/nix/store/kiqb52klbpd9i10q0nnqvmidbxzc1a1j-run-check-harness-psql-17-slim/regression_output/regression.out".
2026-10-07 19:30:53 [ERROR] pg_regress tests failed
2026-10-07 19:30:53 [ERROR] An error occurred. Exit code: 1
2026-10-07 19:30:53 [ERROR] Debug logs:
failed checks.x86_64-linux.psql_orioledb-17 36s
run-check-harness-psql-orioledb-17: 2 of 65 tests failed. ======================= The differences that caused some tests to fail can be viewed in the file "/n …
run-check-harness-psql-orioledb-17:
 2 of 65 tests failed. 
=======================
The differences that caused some tests to fail can be viewed in the
file "/nix/store/xmmk8llcqql2l70ymcmwn157r5sw1mld-run-check-harness-psql-orioledb-17/regression_output/regression.diffs".  A copy of the test summary that you see
above is saved in the file "/nix/store/xmmk8llcqql2l70ymcmwn157r5sw1mld-run-check-harness-psql-orioledb-17/regression_output/regression.out".
2026-10-07 19:30:54 [ERROR] pg_regress tests failed
2026-10-07 19:30:54 [ERROR] An error occurred. Exit code: 1
2026-10-07 19:30:54 [ERROR] Debug logs:
failed checks.x86_64-linux.psql_orioledb-17_slim 36s
run-check-harness-psql-orioledb-17-slim: 2 of 65 tests failed. ======================= The differences that caused some tests to fail can be viewed in the fil …
run-check-harness-psql-orioledb-17-slim:
 2 of 65 tests failed. 
=======================
The differences that caused some tests to fail can be viewed in the
file "/nix/store/k6ca0zwhi49kfgw914rmi8aqr1g3xr6h-run-check-harness-psql-orioledb-17-slim/regression_output/regression.diffs".  A copy of the test summary that you see
above is saved in the file "/nix/store/k6ca0zwhi49kfgw914rmi8aqr1g3xr6h-run-check-harness-psql-orioledb-17-slim/regression_output/regression.out".
2026-10-07 19:30:54 [ERROR] pg_regress tests failed
2026-10-07 19:30:54 [ERROR] An error occurred. Exit code: 1
2026-10-07 19:30:54 [ERROR] Debug logs:
44 succeeded
succeeded attributes
status attribute duration
loading…
68 already built
skipped attributes
status attribute duration
loading…