nixbot

builds

supabase/postgres build #160 failed

branch develop · PR #2506 · commit 08f79168fe · · took 25m 36s · eval 3m 27s

12 failed
failed attributes
status attribute duration
failed checks.aarch64-linux.psql_15 1m 24s
run-check-harness-psql-15: CREATE EXTENSION CREATE EXTENSION CREATE EXTENSION psql:/nix/store/ij5car617qxa8s7zv27zlhn6gxdnqrlj-prime.sql:72: ERROR: PostGIS Ras …
run-check-harness-psql-15:
CREATE EXTENSION
CREATE EXTENSION
CREATE EXTENSION
psql:/nix/store/ij5car617qxa8s7zv27zlhn6gxdnqrlj-prime.sql:72: ERROR:  PostGIS Raster must be in the same schema as PostGIS (tiger)
CONTEXT:  PL/pgSQL function inline_code_block line 11 at RAISE
2026-10-07 20:01:27 [ERROR] Error executing SQL file
2026-10-07 20:01:27 [ERROR] An error occurred. Exit code: 1
2026-10-07 20:01:27 [ERROR] Debug logs:
failed checks.aarch64-linux.psql_15_slim 1m 20s
run-check-harness-psql-15-slim: CREATE EXTENSION CREATE EXTENSION CREATE EXTENSION psql:/nix/store/ij5car617qxa8s7zv27zlhn6gxdnqrlj-prime.sql:72: ERROR: PostGI …
run-check-harness-psql-15-slim:
CREATE EXTENSION
CREATE EXTENSION
CREATE EXTENSION
psql:/nix/store/ij5car617qxa8s7zv27zlhn6gxdnqrlj-prime.sql:72: ERROR:  PostGIS Raster must be in the same schema as PostGIS (tiger)
CONTEXT:  PL/pgSQL function inline_code_block line 11 at RAISE
2026-10-07 20:01:30 [ERROR] Error executing SQL file
2026-10-07 20:01:30 [ERROR] An error occurred. Exit code: 1
2026-10-07 20:01:30 [ERROR] Debug logs:
failed checks.aarch64-linux.psql_17 54s
run-check-harness-psql-17: CREATE EXTENSION CREATE EXTENSION CREATE EXTENSION psql:/nix/store/ij5car617qxa8s7zv27zlhn6gxdnqrlj-prime.sql:72: ERROR: PostGIS Ras …
run-check-harness-psql-17:
CREATE EXTENSION
CREATE EXTENSION
CREATE EXTENSION
psql:/nix/store/ij5car617qxa8s7zv27zlhn6gxdnqrlj-prime.sql:72: ERROR:  PostGIS Raster must be in the same schema as PostGIS (tiger)
CONTEXT:  PL/pgSQL function inline_code_block line 11 at RAISE
2026-10-07 20:01:05 [ERROR] Error executing SQL file
2026-10-07 20:01:05 [ERROR] An error occurred. Exit code: 1
2026-10-07 20:01:05 [ERROR] Debug logs:
failed checks.aarch64-linux.psql_17_slim 1m 18s
run-check-harness-psql-17-slim: CREATE EXTENSION CREATE EXTENSION CREATE EXTENSION psql:/nix/store/ij5car617qxa8s7zv27zlhn6gxdnqrlj-prime.sql:72: ERROR: PostGI …
run-check-harness-psql-17-slim:
CREATE EXTENSION
CREATE EXTENSION
CREATE EXTENSION
psql:/nix/store/ij5car617qxa8s7zv27zlhn6gxdnqrlj-prime.sql:72: ERROR:  PostGIS Raster must be in the same schema as PostGIS (tiger)
CONTEXT:  PL/pgSQL function inline_code_block line 11 at RAISE
2026-10-07 20:01:40 [ERROR] Error executing SQL file
2026-10-07 20:01:40 [ERROR] An error occurred. Exit code: 1
2026-10-07 20:01:40 [ERROR] Debug logs:
failed checks.aarch64-linux.psql_orioledb-17 49s
run-check-harness-psql-orioledb-17: CREATE EXTENSION CREATE EXTENSION CREATE EXTENSION psql:/nix/store/ij5car617qxa8s7zv27zlhn6gxdnqrlj-prime.sql:72: ERROR: Po …
run-check-harness-psql-orioledb-17:
CREATE EXTENSION
CREATE EXTENSION
CREATE EXTENSION
psql:/nix/store/ij5car617qxa8s7zv27zlhn6gxdnqrlj-prime.sql:72: ERROR:  PostGIS Raster must be in the same schema as PostGIS (tiger)
CONTEXT:  PL/pgSQL function inline_code_block line 11 at RAISE
2026-10-07 20:00:52 [ERROR] Error executing SQL file
2026-10-07 20:00:52 [ERROR] An error occurred. Exit code: 1
2026-10-07 20:00:52 [ERROR] Debug logs:
failed checks.aarch64-linux.psql_orioledb-17_slim 1m 1s
run-check-harness-psql-orioledb-17-slim: CREATE EXTENSION CREATE EXTENSION CREATE EXTENSION psql:/nix/store/ij5car617qxa8s7zv27zlhn6gxdnqrlj-prime.sql:72: ERROR …
run-check-harness-psql-orioledb-17-slim:
CREATE EXTENSION
CREATE EXTENSION
CREATE EXTENSION
psql:/nix/store/ij5car617qxa8s7zv27zlhn6gxdnqrlj-prime.sql:72: ERROR:  PostGIS Raster must be in the same schema as PostGIS (tiger)
CONTEXT:  PL/pgSQL function inline_code_block line 11 at RAISE
2026-10-07 20:01:06 [ERROR] Error executing SQL file
2026-10-07 20:01:06 [ERROR] An error occurred. Exit code: 1
2026-10-07 20:01:06 [ERROR] Debug logs:
failed checks.x86_64-linux.psql_15 47s
run-check-harness-psql-15: CREATE EXTENSION CREATE EXTENSION CREATE EXTENSION psql:/nix/store/ij5car617qxa8s7zv27zlhn6gxdnqrlj-prime.sql:72: ERROR: PostGIS Ras …
run-check-harness-psql-15:
CREATE EXTENSION
CREATE EXTENSION
CREATE EXTENSION
psql:/nix/store/ij5car617qxa8s7zv27zlhn6gxdnqrlj-prime.sql:72: ERROR:  PostGIS Raster must be in the same schema as PostGIS (tiger)
CONTEXT:  PL/pgSQL function inline_code_block line 11 at RAISE
2026-10-07 20:02:45 [ERROR] Error executing SQL file
2026-10-07 20:02:45 [ERROR] An error occurred. Exit code: 1
2026-10-07 20:02:45 [ERROR] Debug logs:
failed checks.x86_64-linux.psql_15_slim 53s
run-check-harness-psql-15-slim: CREATE EXTENSION CREATE EXTENSION CREATE EXTENSION psql:/nix/store/ij5car617qxa8s7zv27zlhn6gxdnqrlj-prime.sql:72: ERROR: PostGI …
run-check-harness-psql-15-slim:
CREATE EXTENSION
CREATE EXTENSION
CREATE EXTENSION
psql:/nix/store/ij5car617qxa8s7zv27zlhn6gxdnqrlj-prime.sql:72: ERROR:  PostGIS Raster must be in the same schema as PostGIS (tiger)
CONTEXT:  PL/pgSQL function inline_code_block line 11 at RAISE
2026-10-07 20:03:10 [ERROR] Error executing SQL file
2026-10-07 20:03:10 [ERROR] An error occurred. Exit code: 1
2026-10-07 20:03:10 [ERROR] Debug logs:
failed checks.x86_64-linux.psql_17 35s
run-check-harness-psql-17: CREATE EXTENSION CREATE EXTENSION CREATE EXTENSION psql:/nix/store/ij5car617qxa8s7zv27zlhn6gxdnqrlj-prime.sql:72: ERROR: PostGIS Ras …
run-check-harness-psql-17:
CREATE EXTENSION
CREATE EXTENSION
CREATE EXTENSION
psql:/nix/store/ij5car617qxa8s7zv27zlhn6gxdnqrlj-prime.sql:72: ERROR:  PostGIS Raster must be in the same schema as PostGIS (tiger)
CONTEXT:  PL/pgSQL function inline_code_block line 11 at RAISE
2026-10-07 20:03:45 [ERROR] Error executing SQL file
2026-10-07 20:03:45 [ERROR] An error occurred. Exit code: 1
2026-10-07 20:03:45 [ERROR] Debug logs:
failed checks.x86_64-linux.psql_17_slim 32s
run-check-harness-psql-17-slim: CREATE EXTENSION CREATE EXTENSION CREATE EXTENSION psql:/nix/store/ij5car617qxa8s7zv27zlhn6gxdnqrlj-prime.sql:72: ERROR: PostGI …
run-check-harness-psql-17-slim:
CREATE EXTENSION
CREATE EXTENSION
CREATE EXTENSION
psql:/nix/store/ij5car617qxa8s7zv27zlhn6gxdnqrlj-prime.sql:72: ERROR:  PostGIS Raster must be in the same schema as PostGIS (tiger)
CONTEXT:  PL/pgSQL function inline_code_block line 11 at RAISE
2026-10-07 20:04:10 [ERROR] Error executing SQL file
2026-10-07 20:04:10 [ERROR] An error occurred. Exit code: 1
2026-10-07 20:04:10 [ERROR] Debug logs:
failed checks.x86_64-linux.psql_orioledb-17 33s
run-check-harness-psql-orioledb-17: CREATE EXTENSION CREATE EXTENSION CREATE EXTENSION psql:/nix/store/ij5car617qxa8s7zv27zlhn6gxdnqrlj-prime.sql:72: ERROR: Po …
run-check-harness-psql-orioledb-17:
CREATE EXTENSION
CREATE EXTENSION
CREATE EXTENSION
psql:/nix/store/ij5car617qxa8s7zv27zlhn6gxdnqrlj-prime.sql:72: ERROR:  PostGIS Raster must be in the same schema as PostGIS (tiger)
CONTEXT:  PL/pgSQL function inline_code_block line 11 at RAISE
2026-10-07 20:04:10 [ERROR] Error executing SQL file
2026-10-07 20:04:10 [ERROR] An error occurred. Exit code: 1
2026-10-07 20:04:10 [ERROR] Debug logs:
failed checks.x86_64-linux.psql_orioledb-17_slim 35s
run-check-harness-psql-orioledb-17-slim: CREATE EXTENSION CREATE EXTENSION CREATE EXTENSION psql:/nix/store/ij5car617qxa8s7zv27zlhn6gxdnqrlj-prime.sql:72: ERROR …
run-check-harness-psql-orioledb-17-slim:
CREATE EXTENSION
CREATE EXTENSION
CREATE EXTENSION
psql:/nix/store/ij5car617qxa8s7zv27zlhn6gxdnqrlj-prime.sql:72: ERROR:  PostGIS Raster must be in the same schema as PostGIS (tiger)
CONTEXT:  PL/pgSQL function inline_code_block line 11 at RAISE
2026-10-07 20:03:21 [ERROR] Error executing SQL file
2026-10-07 20:03:21 [ERROR] An error occurred. Exit code: 1
2026-10-07 20:03:21 [ERROR] Debug logs:
44 succeeded
succeeded attributes
status attribute duration
loading…
68 already built
skipped attributes
status attribute duration
loading…