this derivation will be built: /nix/store/c5an85xfd89yv0hp2wyrmknx9br8wcqy-run-check-harness-psql-17.drv these 2 paths will be fetched (23.2 KiB download, 91.8 KiB unpacked): /nix/store/lbnc9h9pp6rfdw3h4jx30hb99b91k0ss-postgres-17-check-harness /nix/store/psza5bjc0x9jfx8jkbv83ih43i2g7rq4-start-postgres-server-test error: Cannot build '/nix/store/c5an85xfd89yv0hp2wyrmknx9br8wcqy-run-check-harness-psql-17.drv'. Reason: builder failed with exit code 1. Output paths: /nix/store/qfpkjv3w44hbn0ih7yc1naaaykqjlgag-run-check-harness-psql-17 Last 25 log lines: > test roles ... ok 14 ms > test security ... ok 11 ms > test storage ... ok 16 ms > test supautils_reserved_roles ... ok 10 ms > test supautils_restrict_versions ... ok 94 ms > test vault ... ok 33 ms > test wal2json ... ok 15 ms > test z_17_ext_interface ... FAILED 141 ms > test z_17_intarray_ltree_query ... ok 15 ms > test z_17_pg_stat_monitor ... ok 8 ms > test z_17_pgvector ... ok 19 ms > test z_17_roles ... ok 18 ms > test z_17_rum ... ok 17 ms > > ======================= > 2 of 68 tests failed. > ======================= > > The differences that caused some tests to fail can be viewed in the > file "/nix/store/qfpkjv3w44hbn0ih7yc1naaaykqjlgag-run-check-harness-psql-17/regression_output/regression.diffs". A copy of the test summary that you see > above is saved in the file "/nix/store/qfpkjv3w44hbn0ih7yc1naaaykqjlgag-run-check-harness-psql-17/regression_output/regression.out". > > 2026-10-07 19:30:53 [ERROR] pg_regress tests failed > 2026-10-07 19:30:53 [ERROR] An error occurred. Exit code: 1 > 2026-10-07 19:30:53 [ERROR] Debug logs: For full logs, run: nix log /nix/store/c5an85xfd89yv0hp2wyrmknx9br8wcqy-run-check-harness-psql-17.drv