setup
checks.x86_64-linux.psql_15_slim
· build #154
· raw
1this derivation will be built:2 /nix/store/s2nrfkqcd26bi63lqc771swl9rxfszi1-run-check-harness-psql-15-slim.drv3error: Cannot build '/nix/store/s2nrfkqcd26bi63lqc771swl9rxfszi1-run-check-harness-psql-15-slim.drv'.4 Reason: builder failed with exit code 1.5 Output paths:6 /nix/store/hd717f8k2v83jkyjnwxqcdahszx72x3z-run-check-harness-psql-15-slim7 Last 25 log lines:8 > test supautils_restrict_versions ... ok 83 ms9 > test vault ... ok 30 ms10 > test wal2json ... ok 17 ms11 > test z_15_ext_interface ... FAILED 668 ms12 > test z_15_intarray_ltree_query ... ok 11 ms13 > test z_15_pg_stat_monitor ... ok 11 ms14 > test z_15_pgjwt ... ok 18 ms15 > test z_15_pgvector ... ok 37 ms16 > test z_15_plv8 ... ok 49 ms17 > test z_15_roles ... ok 18 ms18 > test z_15_rum ... ok 20 ms19 > test z_15_timescale ... ok 21 ms20 > test z_15_unhype_timescale_to_partman ... ok 11430 ms21 >22 > =======================23 > 2 of 72 tests failed.24 > =======================25 >26 > The differences that caused some tests to fail can be viewed in the27 > file "/nix/store/hd717f8k2v83jkyjnwxqcdahszx72x3z-run-check-harness-psql-15-slim/regression_output/regression.diffs". A copy of the test summary that you see28 > above is saved in the file "/nix/store/hd717f8k2v83jkyjnwxqcdahszx72x3z-run-check-harness-psql-15-slim/regression_output/regression.out".29 >30 > 2026-10-07 14:27:00 [ERROR] pg_regress tests failed31 > 2026-10-07 14:27:00 [ERROR] An error occurred. Exit code: 132 > 2026-10-07 14:27:00 [ERROR] Debug logs:33 For full logs, run:34 nix log /nix/store/s2nrfkqcd26bi63lqc771swl9rxfszi1-run-check-harness-psql-15-slim.drv