this derivation will be built: /nix/store/s2nrfkqcd26bi63lqc771swl9rxfszi1-run-check-harness-psql-15-slim.drv error: Cannot build '/nix/store/s2nrfkqcd26bi63lqc771swl9rxfszi1-run-check-harness-psql-15-slim.drv'. Reason: builder failed with exit code 1. Output paths: /nix/store/hd717f8k2v83jkyjnwxqcdahszx72x3z-run-check-harness-psql-15-slim Last 25 log lines: > test supautils_restrict_versions ... ok 83 ms > test vault ... ok 30 ms > test wal2json ... ok 17 ms > test z_15_ext_interface ... FAILED 668 ms > test z_15_intarray_ltree_query ... ok 11 ms > test z_15_pg_stat_monitor ... ok 11 ms > test z_15_pgjwt ... ok 18 ms > test z_15_pgvector ... ok 37 ms > test z_15_plv8 ... ok 49 ms > test z_15_roles ... ok 18 ms > test z_15_rum ... ok 20 ms > test z_15_timescale ... ok 21 ms > test z_15_unhype_timescale_to_partman ... ok 11430 ms > > ======================= > 2 of 72 tests failed. > ======================= > > The differences that caused some tests to fail can be viewed in the > file "/nix/store/hd717f8k2v83jkyjnwxqcdahszx72x3z-run-check-harness-psql-15-slim/regression_output/regression.diffs". A copy of the test summary that you see > above is saved in the file "/nix/store/hd717f8k2v83jkyjnwxqcdahszx72x3z-run-check-harness-psql-15-slim/regression_output/regression.out". > > 2026-10-07 14:27:00 [ERROR] pg_regress tests failed > 2026-10-07 14:27:00 [ERROR] An error occurred. Exit code: 1 > 2026-10-07 14:27:00 [ERROR] Debug logs: For full logs, run: nix log /nix/store/s2nrfkqcd26bi63lqc771swl9rxfszi1-run-check-harness-psql-15-slim.drv