nixbot

builds

supabase/postgres build #154 failed

branch develop · PR #2424 · commit 2fa5940186 · · took 24m 17s · eval 2m 53s

14 failed
failed attributes
status attribute duration
failed checks.aarch64-linux.pre-commit 35s
pre-commit-run: - hook id: treefmt - duration: 1.12s traversed 941 files emitted 235 files for processing formatted 235 files (0 changed) in 1.108s versioning-s …
pre-commit-run:
- hook id: treefmt
- duration: 1.12s
traversed 941 files
emitted 235 files for processing
formatted 235 files (0 changed) in 1.108s
versioning-scheme........................................................Passed
- hook id: versioning-scheme
- duration: 0.01s
failed checks.aarch64-linux.psql_15 1m 53s
run-check-harness-psql-15: 2 of 72 tests failed. ======================= The differences that caused some tests to fail can be viewed in the file "/nix/store/ …
run-check-harness-psql-15:
 2 of 72 tests failed. 
=======================
The differences that caused some tests to fail can be viewed in the
file "/nix/store/6pgzb4bd92l4ivg2y2awc5kmispzsx3v-run-check-harness-psql-15/regression_output/regression.diffs".  A copy of the test summary that you see
above is saved in the file "/nix/store/6pgzb4bd92l4ivg2y2awc5kmispzsx3v-run-check-harness-psql-15/regression_output/regression.out".
2026-10-07 14:26:14 [ERROR] pg_regress tests failed
2026-10-07 14:26:14 [ERROR] An error occurred. Exit code: 1
2026-10-07 14:26:14 [ERROR] Debug logs:
failed checks.aarch64-linux.psql_15_slim 1m 47s
run-check-harness-psql-15-slim: 2 of 72 tests failed. ======================= The differences that caused some tests to fail can be viewed in the file "/nix/s …
run-check-harness-psql-15-slim:
 2 of 72 tests failed. 
=======================
The differences that caused some tests to fail can be viewed in the
file "/nix/store/8g1xh3cn1jjlmgj4g7jdiblxac000gnh-run-check-harness-psql-15-slim/regression_output/regression.diffs".  A copy of the test summary that you see
above is saved in the file "/nix/store/8g1xh3cn1jjlmgj4g7jdiblxac000gnh-run-check-harness-psql-15-slim/regression_output/regression.out".
2026-10-07 14:26:08 [ERROR] pg_regress tests failed
2026-10-07 14:26:08 [ERROR] An error occurred. Exit code: 1
2026-10-07 14:26:08 [ERROR] Debug logs:
failed checks.aarch64-linux.psql_17 43s
run-check-harness-psql-17: 2 of 68 tests failed. ======================= The differences that caused some tests to fail can be viewed in the file "/nix/store/ …
run-check-harness-psql-17:
 2 of 68 tests failed. 
=======================
The differences that caused some tests to fail can be viewed in the
file "/nix/store/720cff84amm6ja327qym0lia8lywr529-run-check-harness-psql-17/regression_output/regression.diffs".  A copy of the test summary that you see
above is saved in the file "/nix/store/720cff84amm6ja327qym0lia8lywr529-run-check-harness-psql-17/regression_output/regression.out".
2026-10-07 14:26:15 [ERROR] pg_regress tests failed
2026-10-07 14:26:15 [ERROR] An error occurred. Exit code: 1
2026-10-07 14:26:15 [ERROR] Debug logs:
failed checks.aarch64-linux.psql_17_slim 42s
run-check-harness-psql-17-slim: 2 of 68 tests failed. ======================= The differences that caused some tests to fail can be viewed in the file "/nix/s …
run-check-harness-psql-17-slim:
 2 of 68 tests failed. 
=======================
The differences that caused some tests to fail can be viewed in the
file "/nix/store/46606zzqx0dsjcvyv17b2h1qhd8bcdg6-run-check-harness-psql-17-slim/regression_output/regression.diffs".  A copy of the test summary that you see
above is saved in the file "/nix/store/46606zzqx0dsjcvyv17b2h1qhd8bcdg6-run-check-harness-psql-17-slim/regression_output/regression.out".
2026-10-07 14:25:57 [ERROR] pg_regress tests failed
2026-10-07 14:25:57 [ERROR] An error occurred. Exit code: 1
2026-10-07 14:25:57 [ERROR] Debug logs:
failed checks.aarch64-linux.psql_orioledb-17 44s
run-check-harness-psql-orioledb-17: 2 of 65 tests failed. ======================= The differences that caused some tests to fail can be viewed in the file "/n …
run-check-harness-psql-orioledb-17:
 2 of 65 tests failed. 
=======================
The differences that caused some tests to fail can be viewed in the
file "/nix/store/lfld7ivccbxrrl2wl4ps4wi2c8857xqw-run-check-harness-psql-orioledb-17/regression_output/regression.diffs".  A copy of the test summary that you see
above is saved in the file "/nix/store/lfld7ivccbxrrl2wl4ps4wi2c8857xqw-run-check-harness-psql-orioledb-17/regression_output/regression.out".
2026-10-07 14:26:17 [ERROR] pg_regress tests failed
2026-10-07 14:26:17 [ERROR] An error occurred. Exit code: 1
2026-10-07 14:26:17 [ERROR] Debug logs:
failed checks.aarch64-linux.psql_orioledb-17_slim 1m 4s
run-check-harness-psql-orioledb-17-slim: 2 of 65 tests failed. ======================= The differences that caused some tests to fail can be viewed in the fil …
run-check-harness-psql-orioledb-17-slim:
 2 of 65 tests failed. 
=======================
The differences that caused some tests to fail can be viewed in the
file "/nix/store/sayg519kqbvhf4wyafmri0i4w9amkpb3-run-check-harness-psql-orioledb-17-slim/regression_output/regression.diffs".  A copy of the test summary that you see
above is saved in the file "/nix/store/sayg519kqbvhf4wyafmri0i4w9amkpb3-run-check-harness-psql-orioledb-17-slim/regression_output/regression.out".
2026-10-07 14:25:25 [ERROR] pg_regress tests failed
2026-10-07 14:25:25 [ERROR] An error occurred. Exit code: 1
2026-10-07 14:25:25 [ERROR] Debug logs:
failed checks.x86_64-linux.pre-commit 21s
pre-commit-run: - hook id: treefmt - duration: 0.63s traversed 941 files emitted 235 files for processing formatted 235 files (0 changed) in 627ms versioning-sc …
pre-commit-run:
- hook id: treefmt
- duration: 0.63s
traversed 941 files
emitted 235 files for processing
formatted 235 files (0 changed) in 627ms
versioning-scheme........................................................Passed
- hook id: versioning-scheme
- duration: 0.01s
failed checks.x86_64-linux.psql_15 58s
run-check-harness-psql-15: 2 of 72 tests failed. ======================= The differences that caused some tests to fail can be viewed in the file "/nix/store/ …
run-check-harness-psql-15:
 2 of 72 tests failed. 
=======================
The differences that caused some tests to fail can be viewed in the
file "/nix/store/pl9r11q96a88zqsmvzmjkkjf18ahflyp-run-check-harness-psql-15/regression_output/regression.diffs".  A copy of the test summary that you see
above is saved in the file "/nix/store/pl9r11q96a88zqsmvzmjkkjf18ahflyp-run-check-harness-psql-15/regression_output/regression.out".
2026-10-07 14:26:52 [ERROR] pg_regress tests failed
2026-10-07 14:26:52 [ERROR] An error occurred. Exit code: 1
2026-10-07 14:26:52 [ERROR] Debug logs:
failed checks.x86_64-linux.psql_15_slim 58s
run-check-harness-psql-15-slim: 2 of 72 tests failed. ======================= The differences that caused some tests to fail can be viewed in the file "/nix/s …
run-check-harness-psql-15-slim:
 2 of 72 tests failed. 
=======================
The differences that caused some tests to fail can be viewed in the
file "/nix/store/hd717f8k2v83jkyjnwxqcdahszx72x3z-run-check-harness-psql-15-slim/regression_output/regression.diffs".  A copy of the test summary that you see
above is saved in the file "/nix/store/hd717f8k2v83jkyjnwxqcdahszx72x3z-run-check-harness-psql-15-slim/regression_output/regression.out".
2026-10-07 14:27:00 [ERROR] pg_regress tests failed
2026-10-07 14:27:00 [ERROR] An error occurred. Exit code: 1
2026-10-07 14:27:00 [ERROR] Debug logs:
failed checks.x86_64-linux.psql_17 31s
run-check-harness-psql-17: 2 of 68 tests failed. ======================= The differences that caused some tests to fail can be viewed in the file "/nix/store/ …
run-check-harness-psql-17:
 2 of 68 tests failed. 
=======================
The differences that caused some tests to fail can be viewed in the
file "/nix/store/il3l0gn7z449a9hasw76in49y9dq8msx-run-check-harness-psql-17/regression_output/regression.diffs".  A copy of the test summary that you see
above is saved in the file "/nix/store/il3l0gn7z449a9hasw76in49y9dq8msx-run-check-harness-psql-17/regression_output/regression.out".
2026-10-07 14:26:25 [ERROR] pg_regress tests failed
2026-10-07 14:26:25 [ERROR] An error occurred. Exit code: 1
2026-10-07 14:26:25 [ERROR] Debug logs:
failed checks.x86_64-linux.psql_17_slim 30s
run-check-harness-psql-17-slim: 2 of 68 tests failed. ======================= The differences that caused some tests to fail can be viewed in the file "/nix/s …
run-check-harness-psql-17-slim:
 2 of 68 tests failed. 
=======================
The differences that caused some tests to fail can be viewed in the
file "/nix/store/kmnc2m54yjcqhwk0m5h2mbxw76yb9qn7-run-check-harness-psql-17-slim/regression_output/regression.diffs".  A copy of the test summary that you see
above is saved in the file "/nix/store/kmnc2m54yjcqhwk0m5h2mbxw76yb9qn7-run-check-harness-psql-17-slim/regression_output/regression.out".
2026-10-07 14:26:32 [ERROR] pg_regress tests failed
2026-10-07 14:26:32 [ERROR] An error occurred. Exit code: 1
2026-10-07 14:26:32 [ERROR] Debug logs:
failed checks.x86_64-linux.psql_orioledb-17 31s
run-check-harness-psql-orioledb-17: 2 of 65 tests failed. ======================= The differences that caused some tests to fail can be viewed in the file "/n …
run-check-harness-psql-orioledb-17:
 2 of 65 tests failed. 
=======================
The differences that caused some tests to fail can be viewed in the
file "/nix/store/dwj9660f3d4lz8379ddkcdag17zya1ga-run-check-harness-psql-orioledb-17/regression_output/regression.diffs".  A copy of the test summary that you see
above is saved in the file "/nix/store/dwj9660f3d4lz8379ddkcdag17zya1ga-run-check-harness-psql-orioledb-17/regression_output/regression.out".
2026-10-07 14:26:40 [ERROR] pg_regress tests failed
2026-10-07 14:26:40 [ERROR] An error occurred. Exit code: 1
2026-10-07 14:26:40 [ERROR] Debug logs:
failed checks.x86_64-linux.psql_orioledb-17_slim 31s
run-check-harness-psql-orioledb-17-slim: 2 of 65 tests failed. ======================= The differences that caused some tests to fail can be viewed in the fil …
run-check-harness-psql-orioledb-17-slim:
 2 of 65 tests failed. 
=======================
The differences that caused some tests to fail can be viewed in the
file "/nix/store/0viac7bvz1cbwa55002kv50h82ww6r91-run-check-harness-psql-orioledb-17-slim/regression_output/regression.diffs".  A copy of the test summary that you see
above is saved in the file "/nix/store/0viac7bvz1cbwa55002kv50h82ww6r91-run-check-harness-psql-orioledb-17-slim/regression_output/regression.out".
2026-10-07 14:26:33 [ERROR] pg_regress tests failed
2026-10-07 14:26:33 [ERROR] An error occurred. Exit code: 1
2026-10-07 14:26:33 [ERROR] Debug logs:
38 succeeded
succeeded attributes
status attribute duration
loading…
74 already built
skipped attributes
status attribute duration
loading…