nixbot

builds
1these 3 derivations will be built:2 /nix/store/p2fnwpjjvfcvnhrd3qvwrv3vvmpd2ac6-start-postgres-server-test.drv3 /nix/store/rv9g6snkzx0kmi64a8biflczxy52b7vh-postgres-17-check-harness.drv4 /nix/store/25zjpqd3vdb62l6qraqbfs6vfbs1nwia-run-check-harness-psql-17-slim.drv5error: Cannot build '/nix/store/25zjpqd3vdb62l6qraqbfs6vfbs1nwia-run-check-harness-psql-17-slim.drv'.6 Reason: builder failed with exit code 1.7 Output paths:8 /nix/store/kmnc2m54yjcqhwk0m5h2mbxw76yb9qn7-run-check-harness-psql-17-slim9 Last 25 log lines:10 > test roles ... ok 12 ms11 > test security ... ok 9 ms12 > test storage ... ok 14 ms13 > test supautils_reserved_roles ... ok 9 ms14 > test supautils_restrict_versions ... ok 80 ms15 > test vault ... ok 27 ms16 > test wal2json ... ok 14 ms17 > test z_17_ext_interface ... FAILED 111 ms18 > test z_17_intarray_ltree_query ... ok 14 ms19 > test z_17_pg_stat_monitor ... ok 7 ms20 > test z_17_pgvector ... ok 14 ms21 > test z_17_roles ... ok 17 ms22 > test z_17_rum ... ok 16 ms23 >24 > =======================25 > 2 of 68 tests failed.26 > =======================27 >28 > The differences that caused some tests to fail can be viewed in the29 > file "/nix/store/kmnc2m54yjcqhwk0m5h2mbxw76yb9qn7-run-check-harness-psql-17-slim/regression_output/regression.diffs". A copy of the test summary that you see30 > above is saved in the file "/nix/store/kmnc2m54yjcqhwk0m5h2mbxw76yb9qn7-run-check-harness-psql-17-slim/regression_output/regression.out".31 >32 > 2026-10-07 13:45:57 [ERROR] pg_regress tests failed33 > 2026-10-07 13:45:57 [ERROR] An error occurred. Exit code: 134 > 2026-10-07 13:45:57 [ERROR] Debug logs:35 For full logs, run:36 nix log /nix/store/25zjpqd3vdb62l6qraqbfs6vfbs1nwia-run-check-harness-psql-17-slim.drv