these 3 derivations will be built: /nix/store/p2fnwpjjvfcvnhrd3qvwrv3vvmpd2ac6-start-postgres-server-test.drv /nix/store/rv9g6snkzx0kmi64a8biflczxy52b7vh-postgres-17-check-harness.drv /nix/store/25zjpqd3vdb62l6qraqbfs6vfbs1nwia-run-check-harness-psql-17-slim.drv error: Cannot build '/nix/store/25zjpqd3vdb62l6qraqbfs6vfbs1nwia-run-check-harness-psql-17-slim.drv'. Reason: builder failed with exit code 1. Output paths: /nix/store/kmnc2m54yjcqhwk0m5h2mbxw76yb9qn7-run-check-harness-psql-17-slim Last 25 log lines: > test roles ... ok 12 ms > test security ... ok 9 ms > test storage ... ok 14 ms > test supautils_reserved_roles ... ok 9 ms > test supautils_restrict_versions ... ok 80 ms > test vault ... ok 27 ms > test wal2json ... ok 14 ms > test z_17_ext_interface ... FAILED 111 ms > test z_17_intarray_ltree_query ... ok 14 ms > test z_17_pg_stat_monitor ... ok 7 ms > test z_17_pgvector ... ok 14 ms > test z_17_roles ... ok 17 ms > test z_17_rum ... ok 16 ms > > ======================= > 2 of 68 tests failed. > ======================= > > The differences that caused some tests to fail can be viewed in the > file "/nix/store/kmnc2m54yjcqhwk0m5h2mbxw76yb9qn7-run-check-harness-psql-17-slim/regression_output/regression.diffs". A copy of the test summary that you see > above is saved in the file "/nix/store/kmnc2m54yjcqhwk0m5h2mbxw76yb9qn7-run-check-harness-psql-17-slim/regression_output/regression.out". > > 2026-10-07 13:45:57 [ERROR] pg_regress tests failed > 2026-10-07 13:45:57 [ERROR] An error occurred. Exit code: 1 > 2026-10-07 13:45:57 [ERROR] Debug logs: For full logs, run: nix log /nix/store/25zjpqd3vdb62l6qraqbfs6vfbs1nwia-run-check-harness-psql-17-slim.drv