nixbot

builds

supabase/postgres build #152 failed

branch develop · PR #2424 · commit 234aa83543 · · took 29m 12s · eval 6m 46s

14 failed
failed attributes
status attribute duration
failed checks.aarch64-linux.pre-commit 34s
pre-commit-run: - hook id: treefmt - duration: 1.1s traversed 941 files emitted 235 files for processing formatted 235 files (0 changed) in 1.093s versioning-sc …
pre-commit-run:
- hook id: treefmt
- duration: 1.1s
traversed 941 files
emitted 235 files for processing
formatted 235 files (0 changed) in 1.093s
versioning-scheme........................................................Passed
- hook id: versioning-scheme
- duration: 0.01s
failed checks.aarch64-linux.psql_15 1m 42s
run-check-harness-psql-15: 2 of 72 tests failed. ======================= The differences that caused some tests to fail can be viewed in the file "/nix/store/ …
run-check-harness-psql-15:
 2 of 72 tests failed. 
=======================
The differences that caused some tests to fail can be viewed in the
file "/nix/store/6pgzb4bd92l4ivg2y2awc5kmispzsx3v-run-check-harness-psql-15/regression_output/regression.diffs".  A copy of the test summary that you see
above is saved in the file "/nix/store/6pgzb4bd92l4ivg2y2awc5kmispzsx3v-run-check-harness-psql-15/regression_output/regression.out".
2026-10-07 13:46:32 [ERROR] pg_regress tests failed
2026-10-07 13:46:32 [ERROR] An error occurred. Exit code: 1
2026-10-07 13:46:32 [ERROR] Debug logs:
failed checks.aarch64-linux.psql_15_slim 1m 43s
run-check-harness-psql-15-slim: 2 of 72 tests failed. ======================= The differences that caused some tests to fail can be viewed in the file "/nix/s …
run-check-harness-psql-15-slim:
 2 of 72 tests failed. 
=======================
The differences that caused some tests to fail can be viewed in the
file "/nix/store/8g1xh3cn1jjlmgj4g7jdiblxac000gnh-run-check-harness-psql-15-slim/regression_output/regression.diffs".  A copy of the test summary that you see
above is saved in the file "/nix/store/8g1xh3cn1jjlmgj4g7jdiblxac000gnh-run-check-harness-psql-15-slim/regression_output/regression.out".
2026-10-07 13:43:46 [ERROR] pg_regress tests failed
2026-10-07 13:43:46 [ERROR] An error occurred. Exit code: 1
2026-10-07 13:43:46 [ERROR] Debug logs:
failed checks.aarch64-linux.psql_17 52s
run-check-harness-psql-17: 2 of 68 tests failed. ======================= The differences that caused some tests to fail can be viewed in the file "/nix/store/ …
run-check-harness-psql-17:
 2 of 68 tests failed. 
=======================
The differences that caused some tests to fail can be viewed in the
file "/nix/store/720cff84amm6ja327qym0lia8lywr529-run-check-harness-psql-17/regression_output/regression.diffs".  A copy of the test summary that you see
above is saved in the file "/nix/store/720cff84amm6ja327qym0lia8lywr529-run-check-harness-psql-17/regression_output/regression.out".
2026-10-07 13:45:24 [ERROR] pg_regress tests failed
2026-10-07 13:45:24 [ERROR] An error occurred. Exit code: 1
2026-10-07 13:45:24 [ERROR] Debug logs:
failed checks.aarch64-linux.psql_17_slim 51s
run-check-harness-psql-17-slim: 2 of 68 tests failed. ======================= The differences that caused some tests to fail can be viewed in the file "/nix/s …
run-check-harness-psql-17-slim:
 2 of 68 tests failed. 
=======================
The differences that caused some tests to fail can be viewed in the
file "/nix/store/46606zzqx0dsjcvyv17b2h1qhd8bcdg6-run-check-harness-psql-17-slim/regression_output/regression.diffs".  A copy of the test summary that you see
above is saved in the file "/nix/store/46606zzqx0dsjcvyv17b2h1qhd8bcdg6-run-check-harness-psql-17-slim/regression_output/regression.out".
2026-10-07 13:45:41 [ERROR] pg_regress tests failed
2026-10-07 13:45:41 [ERROR] An error occurred. Exit code: 1
2026-10-07 13:45:41 [ERROR] Debug logs:
failed checks.aarch64-linux.psql_orioledb-17 55s
run-check-harness-psql-orioledb-17: 2 of 65 tests failed. ======================= The differences that caused some tests to fail can be viewed in the file "/n …
run-check-harness-psql-orioledb-17:
 2 of 65 tests failed. 
=======================
The differences that caused some tests to fail can be viewed in the
file "/nix/store/lfld7ivccbxrrl2wl4ps4wi2c8857xqw-run-check-harness-psql-orioledb-17/regression_output/regression.diffs".  A copy of the test summary that you see
above is saved in the file "/nix/store/lfld7ivccbxrrl2wl4ps4wi2c8857xqw-run-check-harness-psql-orioledb-17/regression_output/regression.out".
2026-10-07 13:45:45 [ERROR] pg_regress tests failed
2026-10-07 13:45:45 [ERROR] An error occurred. Exit code: 1
2026-10-07 13:45:45 [ERROR] Debug logs:
failed checks.aarch64-linux.psql_orioledb-17_slim 57s
run-check-harness-psql-orioledb-17-slim: 2 of 65 tests failed. ======================= The differences that caused some tests to fail can be viewed in the fil …
run-check-harness-psql-orioledb-17-slim:
 2 of 65 tests failed. 
=======================
The differences that caused some tests to fail can be viewed in the
file "/nix/store/sayg519kqbvhf4wyafmri0i4w9amkpb3-run-check-harness-psql-orioledb-17-slim/regression_output/regression.diffs".  A copy of the test summary that you see
above is saved in the file "/nix/store/sayg519kqbvhf4wyafmri0i4w9amkpb3-run-check-harness-psql-orioledb-17-slim/regression_output/regression.out".
2026-10-07 13:42:59 [ERROR] pg_regress tests failed
2026-10-07 13:42:59 [ERROR] An error occurred. Exit code: 1
2026-10-07 13:43:00 [ERROR] Debug logs:
failed checks.x86_64-linux.pre-commit 21s
pre-commit-run: - hook id: treefmt - duration: 0.64s traversed 941 files emitted 235 files for processing formatted 235 files (0 changed) in 635ms versioning-sc …
pre-commit-run:
- hook id: treefmt
- duration: 0.64s
traversed 941 files
emitted 235 files for processing
formatted 235 files (0 changed) in 635ms
versioning-scheme........................................................Passed
- hook id: versioning-scheme
- duration: 0.01s
failed checks.x86_64-linux.psql_15 1m 4s
run-check-harness-psql-15: 2 of 72 tests failed. ======================= The differences that caused some tests to fail can be viewed in the file "/nix/store/ …
run-check-harness-psql-15:
 2 of 72 tests failed. 
=======================
The differences that caused some tests to fail can be viewed in the
file "/nix/store/pl9r11q96a88zqsmvzmjkkjf18ahflyp-run-check-harness-psql-15/regression_output/regression.diffs".  A copy of the test summary that you see
above is saved in the file "/nix/store/pl9r11q96a88zqsmvzmjkkjf18ahflyp-run-check-harness-psql-15/regression_output/regression.out".
2026-10-07 13:46:25 [ERROR] pg_regress tests failed
2026-10-07 13:46:25 [ERROR] An error occurred. Exit code: 1
2026-10-07 13:46:25 [ERROR] Debug logs:
failed checks.x86_64-linux.psql_15_slim 1m 5s
run-check-harness-psql-15-slim: 2 of 72 tests failed. ======================= The differences that caused some tests to fail can be viewed in the file "/nix/s …
run-check-harness-psql-15-slim:
 2 of 72 tests failed. 
=======================
The differences that caused some tests to fail can be viewed in the
file "/nix/store/hd717f8k2v83jkyjnwxqcdahszx72x3z-run-check-harness-psql-15-slim/regression_output/regression.diffs".  A copy of the test summary that you see
above is saved in the file "/nix/store/hd717f8k2v83jkyjnwxqcdahszx72x3z-run-check-harness-psql-15-slim/regression_output/regression.out".
2026-10-07 13:46:25 [ERROR] pg_regress tests failed
2026-10-07 13:46:25 [ERROR] An error occurred. Exit code: 1
2026-10-07 13:46:25 [ERROR] Debug logs:
failed checks.x86_64-linux.psql_17 37s
run-check-harness-psql-17: 2 of 68 tests failed. ======================= The differences that caused some tests to fail can be viewed in the file "/nix/store/ …
run-check-harness-psql-17:
 2 of 68 tests failed. 
=======================
The differences that caused some tests to fail can be viewed in the
file "/nix/store/il3l0gn7z449a9hasw76in49y9dq8msx-run-check-harness-psql-17/regression_output/regression.diffs".  A copy of the test summary that you see
above is saved in the file "/nix/store/il3l0gn7z449a9hasw76in49y9dq8msx-run-check-harness-psql-17/regression_output/regression.out".
2026-10-07 13:45:57 [ERROR] pg_regress tests failed
2026-10-07 13:45:57 [ERROR] An error occurred. Exit code: 1
2026-10-07 13:45:57 [ERROR] Debug logs:
failed checks.x86_64-linux.psql_17_slim 37s
run-check-harness-psql-17-slim: 2 of 68 tests failed. ======================= The differences that caused some tests to fail can be viewed in the file "/nix/s …
run-check-harness-psql-17-slim:
 2 of 68 tests failed. 
=======================
The differences that caused some tests to fail can be viewed in the
file "/nix/store/kmnc2m54yjcqhwk0m5h2mbxw76yb9qn7-run-check-harness-psql-17-slim/regression_output/regression.diffs".  A copy of the test summary that you see
above is saved in the file "/nix/store/kmnc2m54yjcqhwk0m5h2mbxw76yb9qn7-run-check-harness-psql-17-slim/regression_output/regression.out".
2026-10-07 13:45:57 [ERROR] pg_regress tests failed
2026-10-07 13:45:57 [ERROR] An error occurred. Exit code: 1
2026-10-07 13:45:57 [ERROR] Debug logs:
failed checks.x86_64-linux.psql_orioledb-17 37s
run-check-harness-psql-orioledb-17: 2 of 65 tests failed. ======================= The differences that caused some tests to fail can be viewed in the file "/n …
run-check-harness-psql-orioledb-17:
 2 of 65 tests failed. 
=======================
The differences that caused some tests to fail can be viewed in the
file "/nix/store/dwj9660f3d4lz8379ddkcdag17zya1ga-run-check-harness-psql-orioledb-17/regression_output/regression.diffs".  A copy of the test summary that you see
above is saved in the file "/nix/store/dwj9660f3d4lz8379ddkcdag17zya1ga-run-check-harness-psql-orioledb-17/regression_output/regression.out".
2026-10-07 13:45:58 [ERROR] pg_regress tests failed
2026-10-07 13:45:58 [ERROR] An error occurred. Exit code: 1
2026-10-07 13:45:58 [ERROR] Debug logs:
failed checks.x86_64-linux.psql_orioledb-17_slim 40s
run-check-harness-psql-orioledb-17-slim: 2 of 65 tests failed. ======================= The differences that caused some tests to fail can be viewed in the fil …
run-check-harness-psql-orioledb-17-slim:
 2 of 65 tests failed. 
=======================
The differences that caused some tests to fail can be viewed in the
file "/nix/store/0viac7bvz1cbwa55002kv50h82ww6r91-run-check-harness-psql-orioledb-17-slim/regression_output/regression.diffs".  A copy of the test summary that you see
above is saved in the file "/nix/store/0viac7bvz1cbwa55002kv50h82ww6r91-run-check-harness-psql-orioledb-17-slim/regression_output/regression.out".
2026-10-07 13:45:46 [ERROR] pg_regress tests failed
2026-10-07 13:45:46 [ERROR] An error occurred. Exit code: 1
2026-10-07 13:45:46 [ERROR] Debug logs:
46 succeeded
succeeded attributes
status attribute duration
loading…
66 already built
skipped attributes
status attribute duration
loading…