nixbot

builds
1these 3 derivations will be built:2 /nix/store/p9zjvrlish7afalpi0v5d46a62grwqyh-start-postgres-server-test.drv3 /nix/store/bqx4ikwr6m1yf617cyl9m8h2768z1r1c-postgres-17-check-harness.drv4 /nix/store/b7mnmm1r57xwnw53sifhwx2xx2h3d6hh-run-check-harness-psql-17.drv5error: Cannot build '/nix/store/b7mnmm1r57xwnw53sifhwx2xx2h3d6hh-run-check-harness-psql-17.drv'.6 Reason: builder failed with exit code 1.7 Output paths:8 /nix/store/il3l0gn7z449a9hasw76in49y9dq8msx-run-check-harness-psql-179 Last 25 log lines:10 > test roles ... ok 13 ms11 > test security ... ok 11 ms12 > test storage ... ok 17 ms13 > test supautils_reserved_roles ... ok 8 ms14 > test supautils_restrict_versions ... ok 85 ms15 > test vault ... ok 28 ms16 > test wal2json ... ok 15 ms17 > test z_17_ext_interface ... FAILED 112 ms18 > test z_17_intarray_ltree_query ... ok 14 ms19 > test z_17_pg_stat_monitor ... ok 8 ms20 > test z_17_pgvector ... ok 14 ms21 > test z_17_roles ... ok 15 ms22 > test z_17_rum ... ok 14 ms23 >24 > =======================25 > 2 of 68 tests failed.26 > =======================27 >28 > The differences that caused some tests to fail can be viewed in the29 > file "/nix/store/il3l0gn7z449a9hasw76in49y9dq8msx-run-check-harness-psql-17/regression_output/regression.diffs". A copy of the test summary that you see30 > above is saved in the file "/nix/store/il3l0gn7z449a9hasw76in49y9dq8msx-run-check-harness-psql-17/regression_output/regression.out".31 >32 > 2026-10-07 13:45:57 [ERROR] pg_regress tests failed33 > 2026-10-07 13:45:57 [ERROR] An error occurred. Exit code: 134 > 2026-10-07 13:45:57 [ERROR] Debug logs:35 For full logs, run:36 nix log /nix/store/b7mnmm1r57xwnw53sifhwx2xx2h3d6hh-run-check-harness-psql-17.drv