these 3 derivations will be built: /nix/store/p9zjvrlish7afalpi0v5d46a62grwqyh-start-postgres-server-test.drv /nix/store/bqx4ikwr6m1yf617cyl9m8h2768z1r1c-postgres-17-check-harness.drv /nix/store/b7mnmm1r57xwnw53sifhwx2xx2h3d6hh-run-check-harness-psql-17.drv error: Cannot build '/nix/store/b7mnmm1r57xwnw53sifhwx2xx2h3d6hh-run-check-harness-psql-17.drv'. Reason: builder failed with exit code 1. Output paths: /nix/store/il3l0gn7z449a9hasw76in49y9dq8msx-run-check-harness-psql-17 Last 25 log lines: > test roles ... ok 13 ms > test security ... ok 11 ms > test storage ... ok 17 ms > test supautils_reserved_roles ... ok 8 ms > test supautils_restrict_versions ... ok 85 ms > test vault ... ok 28 ms > test wal2json ... ok 15 ms > test z_17_ext_interface ... FAILED 112 ms > test z_17_intarray_ltree_query ... ok 14 ms > test z_17_pg_stat_monitor ... ok 8 ms > test z_17_pgvector ... ok 14 ms > test z_17_roles ... ok 15 ms > test z_17_rum ... ok 14 ms > > ======================= > 2 of 68 tests failed. > ======================= > > The differences that caused some tests to fail can be viewed in the > file "/nix/store/il3l0gn7z449a9hasw76in49y9dq8msx-run-check-harness-psql-17/regression_output/regression.diffs". A copy of the test summary that you see > above is saved in the file "/nix/store/il3l0gn7z449a9hasw76in49y9dq8msx-run-check-harness-psql-17/regression_output/regression.out". > > 2026-10-07 13:45:57 [ERROR] pg_regress tests failed > 2026-10-07 13:45:57 [ERROR] An error occurred. Exit code: 1 > 2026-10-07 13:45:57 [ERROR] Debug logs: For full logs, run: nix log /nix/store/b7mnmm1r57xwnw53sifhwx2xx2h3d6hh-run-check-harness-psql-17.drv