nixbot

builds
1these 3 derivations will be built:2 /nix/store/lm6irsg8zyg2h2bdr4wf73shqdyvxfxa-start-postgres-server-test.drv3 /nix/store/wkjk9gjzgzfamf0lr337dddfna9j3vp3-postgres-orioledb-17-check-harness.drv4 /nix/store/rcfg8pvxn6yk6d2w6jgjix48wdv2klqz-run-check-harness-psql-orioledb-17.drv5error: Cannot build '/nix/store/rcfg8pvxn6yk6d2w6jgjix48wdv2klqz-run-check-harness-psql-orioledb-17.drv'.6 Reason: builder failed with exit code 1.7 Output paths:8 /nix/store/l80pcj4x689fzyj21lqkk3al1lf2farh-run-check-harness-psql-orioledb-179 Last 25 log lines:10 > test wal2json ... ok 18 ms11 > test z_orioledb-17_docs-cascades-deletes ... ok 86 ms12 > test z_orioledb-17_docs-full-text-search ... ok 34 ms13 > test z_orioledb-17_docs-functions ... ok 354 ms14 > test z_orioledb-17_docs-indexes ... ok 29 ms15 > test z_orioledb-17_docs-partitioning ... ok 39 ms16 > test z_orioledb-17_ext_interface ... FAILED 113 ms17 > test z_orioledb-17_extensions_schema ... ok 10 ms18 > test z_orioledb-17_intarray_ltree_query ... ok 11 ms19 > test z_orioledb-17_pg_stat_monitor ... ok 8 ms20 > test z_orioledb-17_pgroonga ... ok 55 ms21 > test z_orioledb-17_pgvector ... ok 17 ms22 > test z_orioledb-17_verify_orioledb ... ok 15 ms23 >24 > =======================25 > 2 of 65 tests failed.26 > =======================27 >28 > The differences that caused some tests to fail can be viewed in the29 > file "/nix/store/l80pcj4x689fzyj21lqkk3al1lf2farh-run-check-harness-psql-orioledb-17/regression_output/regression.diffs". A copy of the test summary that you see30 > above is saved in the file "/nix/store/l80pcj4x689fzyj21lqkk3al1lf2farh-run-check-harness-psql-orioledb-17/regression_output/regression.out".31 >32 > 2026-10-06 11:33:35 [ERROR] pg_regress tests failed33 > 2026-10-06 11:33:35 [ERROR] An error occurred. Exit code: 134 > 2026-10-06 11:33:35 [ERROR] Debug logs:35 For full logs, run:36 nix log /nix/store/rcfg8pvxn6yk6d2w6jgjix48wdv2klqz-run-check-harness-psql-orioledb-17.drv