nixbot

builds

supabase/postgres build #121 failed

branch develop · PR #2433 · commit b3210b6839 · · took 40m 55s · eval 9m 29s

12 failed
failed attributes
status attribute duration
failed checks.aarch64-linux.psql_15 1m 45s
run-check-harness-psql-15: 2 of 72 tests failed. ======================= The differences that caused some tests to fail can be viewed in the file "/nix/store/ …
run-check-harness-psql-15:
 2 of 72 tests failed. 
=======================
The differences that caused some tests to fail can be viewed in the
file "/nix/store/yd4n3zsp49pvl8za51xgdyswhbdhwa34-run-check-harness-psql-15/regression_output/regression.diffs".  A copy of the test summary that you see
above is saved in the file "/nix/store/yd4n3zsp49pvl8za51xgdyswhbdhwa34-run-check-harness-psql-15/regression_output/regression.out".
2026-10-06 11:30:12 [ERROR] pg_regress tests failed
2026-10-06 11:30:12 [ERROR] An error occurred. Exit code: 1
2026-10-06 11:30:12 [ERROR] Debug logs:
failed checks.aarch64-linux.psql_15_slim 1m 45s
run-check-harness-psql-15-slim: 2 of 72 tests failed. ======================= The differences that caused some tests to fail can be viewed in the file "/nix/s …
run-check-harness-psql-15-slim:
 2 of 72 tests failed. 
=======================
The differences that caused some tests to fail can be viewed in the
file "/nix/store/fy6fyymnj22gw22pq5c30mq8rs5kb142-run-check-harness-psql-15-slim/regression_output/regression.diffs".  A copy of the test summary that you see
above is saved in the file "/nix/store/fy6fyymnj22gw22pq5c30mq8rs5kb142-run-check-harness-psql-15-slim/regression_output/regression.out".
2026-10-06 11:30:12 [ERROR] pg_regress tests failed
2026-10-06 11:30:12 [ERROR] An error occurred. Exit code: 1
2026-10-06 11:30:12 [ERROR] Debug logs:
failed checks.aarch64-linux.psql_17 50s
run-check-harness-psql-17: 2 of 68 tests failed. ======================= The differences that caused some tests to fail can be viewed in the file "/nix/store/ …
run-check-harness-psql-17:
 2 of 68 tests failed. 
=======================
The differences that caused some tests to fail can be viewed in the
file "/nix/store/v1lldzwn73bx8gs4zsbp6vs8vxsr2w5j-run-check-harness-psql-17/regression_output/regression.diffs".  A copy of the test summary that you see
above is saved in the file "/nix/store/v1lldzwn73bx8gs4zsbp6vs8vxsr2w5j-run-check-harness-psql-17/regression_output/regression.out".
2026-10-06 11:31:40 [ERROR] pg_regress tests failed
2026-10-06 11:31:40 [ERROR] An error occurred. Exit code: 1
2026-10-06 11:31:40 [ERROR] Debug logs:
failed checks.aarch64-linux.psql_17_slim 56s
run-check-harness-psql-17-slim: 2 of 68 tests failed. ======================= The differences that caused some tests to fail can be viewed in the file "/nix/s …
run-check-harness-psql-17-slim:
 2 of 68 tests failed. 
=======================
The differences that caused some tests to fail can be viewed in the
file "/nix/store/ahnamh0a7yfyjk76j0wfyl0qphaxy8an-run-check-harness-psql-17-slim/regression_output/regression.diffs".  A copy of the test summary that you see
above is saved in the file "/nix/store/ahnamh0a7yfyjk76j0wfyl0qphaxy8an-run-check-harness-psql-17-slim/regression_output/regression.out".
2026-10-06 11:29:23 [ERROR] pg_regress tests failed
2026-10-06 11:29:23 [ERROR] An error occurred. Exit code: 1
2026-10-06 11:29:23 [ERROR] Debug logs:
failed checks.aarch64-linux.psql_orioledb-17 51s
run-check-harness-psql-orioledb-17: 2 of 65 tests failed. ======================= The differences that caused some tests to fail can be viewed in the file "/n …
run-check-harness-psql-orioledb-17:
 2 of 65 tests failed. 
=======================
The differences that caused some tests to fail can be viewed in the
file "/nix/store/zbzzylwfngaji83jn4syc2wz53iyhq0j-run-check-harness-psql-orioledb-17/regression_output/regression.diffs".  A copy of the test summary that you see
above is saved in the file "/nix/store/zbzzylwfngaji83jn4syc2wz53iyhq0j-run-check-harness-psql-orioledb-17/regression_output/regression.out".
2026-10-06 11:30:35 [ERROR] pg_regress tests failed
2026-10-06 11:30:35 [ERROR] An error occurred. Exit code: 1
2026-10-06 11:30:35 [ERROR] Debug logs:
failed checks.aarch64-linux.psql_orioledb-17_slim 58s
run-check-harness-psql-orioledb-17-slim: 2 of 65 tests failed. ======================= The differences that caused some tests to fail can be viewed in the fil …
run-check-harness-psql-orioledb-17-slim:
 2 of 65 tests failed. 
=======================
The differences that caused some tests to fail can be viewed in the
file "/nix/store/cjg95j005qyanra6kkrwy2rcn3ylwqik-run-check-harness-psql-orioledb-17-slim/regression_output/regression.diffs".  A copy of the test summary that you see
above is saved in the file "/nix/store/cjg95j005qyanra6kkrwy2rcn3ylwqik-run-check-harness-psql-orioledb-17-slim/regression_output/regression.out".
2026-10-06 11:29:26 [ERROR] pg_regress tests failed
2026-10-06 11:29:26 [ERROR] An error occurred. Exit code: 1
2026-10-06 11:29:26 [ERROR] Debug logs:
failed checks.x86_64-linux.psql_15 59s
run-check-harness-psql-15: 2 of 72 tests failed. ======================= The differences that caused some tests to fail can be viewed in the file "/nix/store/ …
run-check-harness-psql-15:
 2 of 72 tests failed. 
=======================
The differences that caused some tests to fail can be viewed in the
file "/nix/store/4nnkh6bas4krq4avcn7zi9l1aibcilz9-run-check-harness-psql-15/regression_output/regression.diffs".  A copy of the test summary that you see
above is saved in the file "/nix/store/4nnkh6bas4krq4avcn7zi9l1aibcilz9-run-check-harness-psql-15/regression_output/regression.out".
2026-10-06 11:33:29 [ERROR] pg_regress tests failed
2026-10-06 11:33:29 [ERROR] An error occurred. Exit code: 1
2026-10-06 11:33:29 [ERROR] Debug logs:
failed checks.x86_64-linux.psql_15_slim 1m 5s
run-check-harness-psql-15-slim: 2 of 72 tests failed. ======================= The differences that caused some tests to fail can be viewed in the file "/nix/s …
run-check-harness-psql-15-slim:
 2 of 72 tests failed. 
=======================
The differences that caused some tests to fail can be viewed in the
file "/nix/store/p2adh1s2gnax8bb8hklh7c6pl3c4ylqz-run-check-harness-psql-15-slim/regression_output/regression.diffs".  A copy of the test summary that you see
above is saved in the file "/nix/store/p2adh1s2gnax8bb8hklh7c6pl3c4ylqz-run-check-harness-psql-15-slim/regression_output/regression.out".
2026-10-06 11:33:15 [ERROR] pg_regress tests failed
2026-10-06 11:33:15 [ERROR] An error occurred. Exit code: 1
2026-10-06 11:33:15 [ERROR] Debug logs:
failed checks.x86_64-linux.psql_17 35s
run-check-harness-psql-17: 2 of 68 tests failed. ======================= The differences that caused some tests to fail can be viewed in the file "/nix/store/ …
run-check-harness-psql-17:
 2 of 68 tests failed. 
=======================
The differences that caused some tests to fail can be viewed in the
file "/nix/store/9xrzbv4v0iv51aza4py3j90w289wa2vg-run-check-harness-psql-17/regression_output/regression.diffs".  A copy of the test summary that you see
above is saved in the file "/nix/store/9xrzbv4v0iv51aza4py3j90w289wa2vg-run-check-harness-psql-17/regression_output/regression.out".
2026-10-06 11:33:26 [ERROR] pg_regress tests failed
2026-10-06 11:33:26 [ERROR] An error occurred. Exit code: 1
2026-10-06 11:33:26 [ERROR] Debug logs:
failed checks.x86_64-linux.psql_17_slim 36s
run-check-harness-psql-17-slim: 2 of 68 tests failed. ======================= The differences that caused some tests to fail can be viewed in the file "/nix/s …
run-check-harness-psql-17-slim:
 2 of 68 tests failed. 
=======================
The differences that caused some tests to fail can be viewed in the
file "/nix/store/2mr0ihkv6n6gsmb9m3kv49flr39x042p-run-check-harness-psql-17-slim/regression_output/regression.diffs".  A copy of the test summary that you see
above is saved in the file "/nix/store/2mr0ihkv6n6gsmb9m3kv49flr39x042p-run-check-harness-psql-17-slim/regression_output/regression.out".
2026-10-06 11:32:58 [ERROR] pg_regress tests failed
2026-10-06 11:32:58 [ERROR] An error occurred. Exit code: 1
2026-10-06 11:32:58 [ERROR] Debug logs:
failed checks.x86_64-linux.psql_orioledb-17 36s
run-check-harness-psql-orioledb-17: 2 of 65 tests failed. ======================= The differences that caused some tests to fail can be viewed in the file "/n …
run-check-harness-psql-orioledb-17:
 2 of 65 tests failed. 
=======================
The differences that caused some tests to fail can be viewed in the
file "/nix/store/l80pcj4x689fzyj21lqkk3al1lf2farh-run-check-harness-psql-orioledb-17/regression_output/regression.diffs".  A copy of the test summary that you see
above is saved in the file "/nix/store/l80pcj4x689fzyj21lqkk3al1lf2farh-run-check-harness-psql-orioledb-17/regression_output/regression.out".
2026-10-06 11:33:35 [ERROR] pg_regress tests failed
2026-10-06 11:33:35 [ERROR] An error occurred. Exit code: 1
2026-10-06 11:33:35 [ERROR] Debug logs:
failed checks.x86_64-linux.psql_orioledb-17_slim 36s
run-check-harness-psql-orioledb-17-slim: 2 of 65 tests failed. ======================= The differences that caused some tests to fail can be viewed in the fil …
run-check-harness-psql-orioledb-17-slim:
 2 of 65 tests failed. 
=======================
The differences that caused some tests to fail can be viewed in the
file "/nix/store/4ms3jravx0wzgfrwqkz709p7bjrdzgj1-run-check-harness-psql-orioledb-17-slim/regression_output/regression.diffs".  A copy of the test summary that you see
above is saved in the file "/nix/store/4ms3jravx0wzgfrwqkz709p7bjrdzgj1-run-check-harness-psql-orioledb-17-slim/regression_output/regression.out".
2026-10-06 11:33:05 [ERROR] pg_regress tests failed
2026-10-06 11:33:05 [ERROR] An error occurred. Exit code: 1
2026-10-06 11:33:05 [ERROR] Debug logs:
72 succeeded
succeeded attributes
status attribute duration
loading…
40 already built
skipped attributes
status attribute duration
loading…