these 3 derivations will be built: /nix/store/lm6irsg8zyg2h2bdr4wf73shqdyvxfxa-start-postgres-server-test.drv /nix/store/wkjk9gjzgzfamf0lr337dddfna9j3vp3-postgres-orioledb-17-check-harness.drv /nix/store/rcfg8pvxn6yk6d2w6jgjix48wdv2klqz-run-check-harness-psql-orioledb-17.drv error: Cannot build '/nix/store/rcfg8pvxn6yk6d2w6jgjix48wdv2klqz-run-check-harness-psql-orioledb-17.drv'. Reason: builder failed with exit code 1. Output paths: /nix/store/l80pcj4x689fzyj21lqkk3al1lf2farh-run-check-harness-psql-orioledb-17 Last 25 log lines: > test wal2json ... ok 18 ms > test z_orioledb-17_docs-cascades-deletes ... ok 86 ms > test z_orioledb-17_docs-full-text-search ... ok 34 ms > test z_orioledb-17_docs-functions ... ok 354 ms > test z_orioledb-17_docs-indexes ... ok 29 ms > test z_orioledb-17_docs-partitioning ... ok 39 ms > test z_orioledb-17_ext_interface ... FAILED 113 ms > test z_orioledb-17_extensions_schema ... ok 10 ms > test z_orioledb-17_intarray_ltree_query ... ok 11 ms > test z_orioledb-17_pg_stat_monitor ... ok 8 ms > test z_orioledb-17_pgroonga ... ok 55 ms > test z_orioledb-17_pgvector ... ok 17 ms > test z_orioledb-17_verify_orioledb ... ok 15 ms > > ======================= > 2 of 65 tests failed. > ======================= > > The differences that caused some tests to fail can be viewed in the > file "/nix/store/l80pcj4x689fzyj21lqkk3al1lf2farh-run-check-harness-psql-orioledb-17/regression_output/regression.diffs". A copy of the test summary that you see > above is saved in the file "/nix/store/l80pcj4x689fzyj21lqkk3al1lf2farh-run-check-harness-psql-orioledb-17/regression_output/regression.out". > > 2026-10-06 11:33:35 [ERROR] pg_regress tests failed > 2026-10-06 11:33:35 [ERROR] An error occurred. Exit code: 1 > 2026-10-06 11:33:35 [ERROR] Debug logs: For full logs, run: nix log /nix/store/rcfg8pvxn6yk6d2w6jgjix48wdv2klqz-run-check-harness-psql-orioledb-17.drv