setup
checks.aarch64-linux.pre-commit
· build #520
· raw
1these 12 derivations will be built:2 /nix/store/faxd780c5agczkj8licsiv1syly2gbi1-dotnet-stage0-vmr-8.0.22.drv3 /nix/store/cr5cfwkl6irq13p1skg0nqfxw0k7jgfy-dotnet-stage0-sdk-8.0.122.drv4 /nix/store/ghq102mjmg1l6vhqsrzsqcwjc7bkcf6n-dotnet-vmr-8.0.22.drv5 /nix/store/07h4bsvnk2jzzkj1dwfgawf67f9ip47c-dotnet-aspnetcore-runtime-8.0.22.drv6 /nix/store/3drxg5w884i8xjdfr5wbs6axd76fcv0h-dotnet-runtime-8.0.22.drv7 /nix/store/r4wh5fcbd41da6kjn4d709vwm2h7vlyj-dotnet-runtime-wrapped-8.0.22.drv8 /nix/store/zssn1ns2hr7hbpb9sab2ixg2k2nkgbfw-dotnet-aspnetcore-runtime-wrapped-8.0.22.drv9 /nix/store/vhbhs03h1qh5r2fy5sbk0r8cmnn6y90m-dotnet-sdk-8.0.416.drv10 /nix/store/nipn3wglh0ab40yq3mw3535yy4g43lvw-dotnet-sdk-wrapped-8.0.416.drv11 /nix/store/c8pgxpacf95rzc7xknl8fzlsidf0y2nd-pre-commit-4.5.1.drv12 /nix/store/q8p4rlm7p769dmbd65b0hcvikfvw1lkz-pre-commit-config.json.drv13 /nix/store/6gazqbv4wbcfzvn9vpwfg4qq28cxiirs-pre-commit-run.drv14error: build of '/nix/store/faxd780c5agczkj8licsiv1syly2gbi1-dotnet-stage0-vmr-8.0.22.drv' on 'ssh-ng://nixbot-remote-build@78.232.36.247' failed: Cannot build '/nix/store/faxd780c5agczkj8licsiv1syly2gbi1-dotnet-stage0-vmr-8.0.22.drv'.15 Reason: builder failed with exit code 1.16 Output paths:17 /nix/store/9jysydyd169bbf6pbp2zp26yyzgyzvv8-dotnet-stage0-vmr-8.0.22-man18 /nix/store/makvsav7nd8r9xsw9x50nrl87q83j9gy-dotnet-stage0-vmr-8.0.22-debug19 /nix/store/pc6l6y1982y1knfin5v0crw68dybsiwn-dotnet-stage0-vmr-8.0.2220 Last 25 log lines:21 > [17:59:34.28] Building 'humanizer'...done22 > [17:59:38.00] Building 'xunit'...done23 >24 > Build FAILED.25 >26 > /build/dotnet-8.0.122/src/source-build-externals/artifacts/source-build/self/src/repo-projects/azure-activedirectory-identitymodel-extensions-for-dotnet.proj(35,5): error MSB3073: The command "/build/dotnet-8.0.122/.dotnet/dotnet build /bl:build.binlog /build/dotnet-8.0.122/src/source-build-externals/artifacts/source-build/self/src/src/azure-activedirectory-identitymodel-extensions-for-dotnet/src/System.IdentityModel.Tokens.Jwt/System.IdentityModel.Tokens.Jwt.csproj /p:Configuration=Release /v:minimal >> /build/dotnet-8.0.122/src/source-build-externals/artifacts/source-build/self/src/artifacts/bin/azure-activedirectory-identitymodel-extensions-for-dotnet/logs/azure-activedirectory-identitymodel-extensions-for-dotnet.log 2>&1 /p:Version=7.1.2" exited with code 1.27 > 0 Warning(s)28 > 1 Error(s)29 >30 > Time Elapsed 00:00:41.9531 > /build/dotnet-8.0.122/artifacts/source-built-sdks/Microsoft.DotNet.Arcade.Sdk/tools/SourceBuild/SourceBuildArcadeBuild.targets(207,5): error MSB3073: The command "/build/dotnet-8.0.122/.dotnet//dotnet msbuild /m /nologo /clp:Summary /v:minimal /nr:false /warnaserror /p:TreatWarningsAsErrors=true /p:ContinuousIntegrationBuild=true /build/dotnet-8.0.122/artifacts/source-built-sdks/Microsoft.DotNet.Arcade.Sdk/tools/Build.proj /bl:"/build/dotnet-8.0.122/src/source-build-externals/artifacts/log/Release/Build.binlog" /p:Configuration=Release /p:RepoRoot=/build/dotnet-8.0.122/src/source-build-externals/ /p:Restore=true /p:Build=true /p:ArcadeBuildFromSource=false /p:Rebuild=false /p:Test=false /p:Pack=true /p:IntegrationTest=false /p:PerformanceTest=false /p:Sign=false /p:Publish=true /p:ArcadeBuildFromSource=true /p:CopyWipIntoInnerSourceBuildRepo=true /p:DotNetBuildOffline=true /p:CopySrcInsteadOfClone=true /p:DotNetPackageVersionPropsPath=/build/dotnet-8.0.122/artifacts/obj/arm64/Release/PackageVersions.source-build-externals.props /p:AdditionalSourceBuiltNupkgCacheDir=/build/dotnet-8.0.122/artifacts/obj/arm64/Release/blob-feed/packages/ /p:ReferencePackageNupkgCacheDir=/build/dotnet-8.0.122/prereqs/packages/reference/ /p:PreviouslySourceBuiltNupkgCacheDir=/nix/store/4wv493dricb7sm1zz27n24n0j86d3j4r-Private.SourceBuilt.Artifacts.8.0.121-servicing.25476.1.centos.9-x64/ /p:SourceBuildUseMonoRuntime= /v:minimal -logger:/build/dotnet-8.0.122/artifacts/source-built-sdks/Microsoft.DotNet.Arcade.Sdk/tools/net8.0/Microsoft.DotNet.ArcadeLogging.dll /p:ArcadeInnerBuildFromSource=true /p:DotNetBuildFromSource=true /p:RepoRoot=/build/dotnet-8.0.122/src/source-build-externals/artifacts/source-build/self/src/ /p:ArtifactsDir=/build/dotnet-8.0.122/src/source-build-externals/artifacts/source-build/self/src/artifacts/ /bl:/build/dotnet-8.0.122/src/source-build-externals/artifacts/source-build/self/src/artifacts/sourcebuild.binlog /p:ContinuousIntegrationBuild=true /p:SourceBuildOutputDir=/build/dotnet-8.0.122/src/source-build-externals/artifacts/source-build/ /p:SourceBuiltBlobFeedDir= /p:DotNetBuildOffline=true /p:DotNetPackageVersionPropsPath=/build/dotnet-8.0.122/artifacts/obj/arm64/Release/PackageVersions.source-build-externals.props /p:FullAssemblySigningSupported=false" exited with code 1. [/build/dotnet-8.0.122/artifacts/source-built-sdks/Microsoft.DotNet.Arcade.Sdk/tools/Build.proj]32 > ##vso[task.logissue type=error;sourcepath=/build/dotnet-8.0.122/artifacts/source-built-sdks/Microsoft.DotNet.Arcade.Sdk/tools/SourceBuild/SourceBuildArcadeBuild.targets;linenumber=207;columnnumber=5;code=MSB3073;]The command "/build/dotnet-8.0.122/.dotnet//dotnet msbuild /m /nologo /clp:Summary /v:minimal /nr:false /warnaserror /p:TreatWarningsAsErrors=true /p:ContinuousIntegrationBuild=true /build/dotnet-8.0.122/artifacts/source-built-sdks/Microsoft.DotNet.Arcade.Sdk/tools/Build.proj /bl:"/build/dotnet-8.0.122/src/source-build-externals/artifacts/log/Release/Build.binlog" /p:Configuration=Release /p:RepoRoot=/build/dotnet-8.0.122/src/source-build-externals/ /p:Restore=true /p:Build=true /p:ArcadeBuildFromSource=false /p:Rebuild=false /p:Test=false /p:Pack=true /p:IntegrationTest=false /p:PerformanceTest=false /p:Sign=false /p:Publish=true /p:ArcadeBuildFromSource=true /p:CopyWipIntoInnerSourceBuildRepo=true /p:DotNetBuildOffline=true /p:CopySrcInsteadOfClone=true /p:DotNetPackageVersionPropsPath=/build/dotnet-8.0.122/artifacts/obj/arm64/Release/PackageVersions.source-build-externals.props /p:AdditionalSourceBuiltNupkgCacheDir=/build/dotnet-8.0.122/artifacts/obj/arm64/Release/blob-feed/packages/ /p:ReferencePackageNupkgCacheDir=/build/dotnet-8.0.122/prereqs/packages/reference/ /p:PreviouslySourceBuiltNupkgCacheDir=/nix/store/4wv493dricb7sm1zz27n24n0j86d3j4r-Private.SourceBuilt.Artifacts.8.0.121-servicing.25476.1.centos.9-x64/ /p:SourceBuildUseMonoRuntime= /v:minimal -logger:/build/dotnet-8.0.122/artifacts/source-built-sdks/Microsoft.DotNet.Arcade.Sdk/tools/net8.0/Microsoft.DotNet.ArcadeLogging.dll /p:ArcadeInnerBuildFromSource=true /p:DotNetBuildFromSource=true /p:RepoRoot=/build/dotnet-8.0.122/src/source-build-externals/artifacts/source-build/self/src/ /p:ArtifactsDir=/build/dotnet-8.0.122/src/source-build-externals/artifacts/source-build/self/src/artifacts/ /bl:/build/dotnet-8.0.122/src/source-build-externals/artifacts/source-build/self/src/artifacts/sourcebuild.binlog /p:ContinuousIntegrationBuild=true /p:SourceBuildOutputDir=/build/dotnet-8.0.122/src/source-build-externals/artifacts/source-build/ /p:SourceBuiltBlobFeedDir= /p:DotNetBuildOffline=true /p:DotNetPackageVersionPropsPath=/build/dotnet-8.0.122/artifacts/obj/arm64/Release/PackageVersions.source-build-externals.props /p:FullAssemblySigningSupported=false" exited with code 1.33 >34 > Build FAILED.35 >36 > /build/dotnet-8.0.122/artifacts/source-built-sdks/Microsoft.DotNet.Arcade.Sdk/tools/SourceBuild/SourceBuildArcadeBuild.targets(207,5): error MSB3073: The command "/build/dotnet-8.0.122/.dotnet//dotnet msbuild /m /nologo /clp:Summary /v:minimal /nr:false /warnaserror /p:TreatWarningsAsErrors=true /p:ContinuousIntegrationBuild=true /build/dotnet-8.0.122/artifacts/source-built-sdks/Microsoft.DotNet.Arcade.Sdk/tools/Build.proj /bl:"/build/dotnet-8.0.122/src/source-build-externals/artifacts/log/Release/Build.binlog" /p:Configuration=Release /p:RepoRoot=/build/dotnet-8.0.122/src/source-build-externals/ /p:Restore=true /p:Build=true /p:ArcadeBuildFromSource=false /p:Rebuild=false /p:Test=false /p:Pack=true /p:IntegrationTest=false /p:PerformanceTest=false /p:Sign=false /p:Publish=true /p:ArcadeBuildFromSource=true /p:CopyWipIntoInnerSourceBuildRepo=true /p:DotNetBuildOffline=true /p:CopySrcInsteadOfClone=true /p:DotNetPackageVersionPropsPath=/build/dotnet-8.0.122/artifacts/obj/arm64/Release/PackageVersions.source-build-externals.props /p:AdditionalSourceBuiltNupkgCacheDir=/build/dotnet-8.0.122/artifacts/obj/arm64/Release/blob-feed/packages/ /p:ReferencePackageNupkgCacheDir=/build/dotnet-8.0.122/prereqs/packages/reference/ /p:PreviouslySourceBuiltNupkgCacheDir=/nix/store/4wv493dricb7sm1zz27n24n0j86d3j4r-Private.SourceBuilt.Artifacts.8.0.121-servicing.25476.1.centos.9-x64/ /p:SourceBuildUseMonoRuntime= /v:minimal -logger:/build/dotnet-8.0.122/artifacts/source-built-sdks/Microsoft.DotNet.Arcade.Sdk/tools/net8.0/Microsoft.DotNet.ArcadeLogging.dll /p:ArcadeInnerBuildFromSource=true /p:DotNetBuildFromSource=true /p:RepoRoot=/build/dotnet-8.0.122/src/source-build-externals/artifacts/source-build/self/src/ /p:ArtifactsDir=/build/dotnet-8.0.122/src/source-build-externals/artifacts/source-build/self/src/artifacts/ /bl:/build/dotnet-8.0.122/src/source-build-externals/artifacts/source-build/self/src/artifacts/sourcebuild.binlog /p:ContinuousIntegrationBuild=true /p:SourceBuildOutputDir=/build/dotnet-8.0.122/src/source-build-externals/artifacts/source-build/ /p:SourceBuiltBlobFeedDir= /p:DotNetBuildOffline=true /p:DotNetPackageVersionPropsPath=/build/dotnet-8.0.122/artifacts/obj/arm64/Release/PackageVersions.source-build-externals.props /p:FullAssemblySigningSupported=false" exited with code 1. [/build/dotnet-8.0.122/artifacts/source-built-sdks/Microsoft.DotNet.Arcade.Sdk/tools/Build.proj]37 > 0 Warning(s)38 > 1 Error(s)39 >40 > Time Elapsed 00:00:45.6041 > Build failed with exit code 1. Check errors above.42 >43 > 'source-build-externals' failed during build.44 > See '/build/dotnet-8.0.122/artifacts/logs/source-build-externals.log' for more information.45 > 'dotnet' failed during build.46 For full logs, run:47 nix log /nix/store/faxd780c5agczkj8licsiv1syly2gbi1-dotnet-stage0-vmr-8.0.22.drv48error: Cannot build '/nix/store/faxd780c5agczkj8licsiv1syly2gbi1-dotnet-stage0-vmr-8.0.22.drv'.49 Reason: builder failed with exit code 1.50 Output paths:51 /nix/store/9jysydyd169bbf6pbp2zp26yyzgyzvv8-dotnet-stage0-vmr-8.0.22-man52 /nix/store/makvsav7nd8r9xsw9x50nrl87q83j9gy-dotnet-stage0-vmr-8.0.22-debug53 /nix/store/pc6l6y1982y1knfin5v0crw68dybsiwn-dotnet-stage0-vmr-8.0.2254error: Cannot build '/nix/store/cr5cfwkl6irq13p1skg0nqfxw0k7jgfy-dotnet-stage0-sdk-8.0.122.drv'.55 Reason: 1 dependency failed.56 Output paths:57 /nix/store/0bblgl0c8kf3adl5xyrrw5m4ch0lsmja-dotnet-stage0-sdk-8.0.122-man58 /nix/store/gpx8261yphdxik5hwx9nrz8m9qzpd9jz-dotnet-stage0-sdk-8.0.12259 /nix/store/nfzgqsbmgz48mvjq90iaiybzr21myxwk-dotnet-stage0-sdk-8.0.122-artifacts60error: Cannot build '/nix/store/ghq102mjmg1l6vhqsrzsqcwjc7bkcf6n-dotnet-vmr-8.0.22.drv'.61 Reason: 1 dependency failed.62 Output paths:63 /nix/store/b3ihjqq8sn6ia9b1rs8yfkk0ckz3a4pv-dotnet-vmr-8.0.2264 /nix/store/pkdq4sdpw7kd9lf8wnch1fpvahssyjls-dotnet-vmr-8.0.22-debug65 /nix/store/y4w7zfza120a69xvy3x8lw01ilq50964-dotnet-vmr-8.0.22-man66error: Cannot build '/nix/store/07h4bsvnk2jzzkj1dwfgawf67f9ip47c-dotnet-aspnetcore-runtime-8.0.22.drv'.67 Reason: 1 dependency failed.68 Output paths:69 /nix/store/9mms9qv4zik86lddacb350sfx1iasrjp-dotnet-aspnetcore-runtime-8.0.22-man70 /nix/store/fl8clinzgcbywknlaq5g96bv9jplw7hv-dotnet-aspnetcore-runtime-8.0.2271error: Cannot build '/nix/store/3drxg5w884i8xjdfr5wbs6axd76fcv0h-dotnet-runtime-8.0.22.drv'.72 Reason: 1 dependency failed.73 Output paths:74 /nix/store/6rvs82293bvfs5mv1ic6z9248g88n2x7-dotnet-runtime-8.0.2275 /nix/store/d1pv5n9k8j46nzw2ildvpz8v2m659byx-dotnet-runtime-8.0.22-man76error: Cannot build '/nix/store/zssn1ns2hr7hbpb9sab2ixg2k2nkgbfw-dotnet-aspnetcore-runtime-wrapped-8.0.22.drv'.77 Reason: 1 dependency failed.78 Output paths:79 /nix/store/0c5hckf4r0pz8gzac5w316r4y8ljznq8-dotnet-aspnetcore-runtime-wrapped-8.0.2280 /nix/store/68z4q7cwxn7radijak6frxwc6cp8pagm-dotnet-aspnetcore-runtime-wrapped-8.0.22-man81error: Cannot build '/nix/store/r4wh5fcbd41da6kjn4d709vwm2h7vlyj-dotnet-runtime-wrapped-8.0.22.drv'.82 Reason: 1 dependency failed.83 Output paths:84 /nix/store/7nssmw2vvfgzwa7m7hg9haj5x7z5sdal-dotnet-runtime-wrapped-8.0.22-man85 /nix/store/ms54ir31wzjyxjg394m087y9vzac0j7w-dotnet-runtime-wrapped-8.0.2286error: Cannot build '/nix/store/vhbhs03h1qh5r2fy5sbk0r8cmnn6y90m-dotnet-sdk-8.0.416.drv'.87 Reason: 2 dependencies failed.88 Output paths:89 /nix/store/ayax88q0gy0yll7qv6lb3y9i8xi2r87n-dotnet-sdk-8.0.41690error: Cannot build '/nix/store/nipn3wglh0ab40yq3mw3535yy4g43lvw-dotnet-sdk-wrapped-8.0.416.drv'.91 Reason: 1 dependency failed.92 Output paths:93 /nix/store/fas0zic7ax15c311rhb5q7lmwhsdwyhj-dotnet-sdk-wrapped-8.0.41694error: Cannot build '/nix/store/c8pgxpacf95rzc7xknl8fzlsidf0y2nd-pre-commit-4.5.1.drv'.95 Reason: 1 dependency failed.96 Output paths:97 /nix/store/qzdc908balqw2b0z2mjinskra0gqa4f4-pre-commit-4.5.198 /nix/store/rssbz8w2r2x7xs6ppj0frb6x9py8jl94-pre-commit-4.5.1-dist99error: Cannot build '/nix/store/q8p4rlm7p769dmbd65b0hcvikfvw1lkz-pre-commit-config.json.drv'.100 Reason: 1 dependency failed.101 Output paths:102 /nix/store/91iimgq6z39nx61blym8hgd66rsp10sp-pre-commit-config.json103error: Cannot build '/nix/store/6gazqbv4wbcfzvn9vpwfg4qq28cxiirs-pre-commit-run.drv'.104 Reason: 2 dependencies failed.105 Output paths:106 /nix/store/hbbv4yl4vvk1gknjp4pihwigziv6ds03-pre-commit-run