nixbot

builds

supabase/postgres build #520 failed

branch 17.11.0.016-x86 · commit 3c68eca53c · · took 11m 43s · eval 1m 51s

4 failed
failed attributes
status attribute duration
failed checks.aarch64-linux.devShell 11m 39s
dotnet-stage0-vmr-8.0.22: /build/dotnet-8.0.122/artifacts/source-built-sdks/Microsoft.DotNet.Arcade.Sdk/tools/SourceBuild/SourceBuildArcadeBuild.targets(207,5 …
dotnet-stage0-vmr-8.0.22:
  /build/dotnet-8.0.122/artifacts/source-built-sdks/Microsoft.DotNet.Arcade.Sdk/tools/SourceBuild/SourceBuildArcadeBuild.targets(207,5): error MSB3073: The command "/build/dotnet-8.0.122/.dotnet//dotnet msbuild /m /nologo /clp:Summary /v:minimal /nr:false /warnaserror /p:TreatWarningsAsErrors=true /p:ContinuousIntegrationBuild=true /build/dotnet-8.0.122/artifacts/source-built-sdks/Microsoft.DotNet.Arcade.Sdk/tools/Build.proj /bl:"/build/dotnet-8.0.122/src/source-build-externals/artifacts/log/Release/Build.binlog" /p:Configuration=Release /p:RepoRoot=/build/dotnet-8.0.122/src/source-build-externals/ /p:Restore=true /p:Build=true /p:ArcadeBuil…
      0 Warning(s)
      1 Error(s)
  Time Elapsed 00:00:34.12
  Build failed with exit code 1. Check errors above.
  'source-build-externals' failed during build.
  See '/build/dotnet-8.0.122/artifacts/logs/source-build-externals.log' for more information.
  'dotnet' failed during build.
failed checks.aarch64-linux.pre-commit 6m 26s
dotnet-stage0-vmr-8.0.22: /build/dotnet-8.0.122/artifacts/source-built-sdks/Microsoft.DotNet.Arcade.Sdk/tools/SourceBuild/SourceBuildArcadeBuild.targets(207,5 …
dotnet-stage0-vmr-8.0.22:
  /build/dotnet-8.0.122/artifacts/source-built-sdks/Microsoft.DotNet.Arcade.Sdk/tools/SourceBuild/SourceBuildArcadeBuild.targets(207,5): error MSB3073: The command "/build/dotnet-8.0.122/.dotnet//dotnet msbuild /m /nologo /clp:Summary /v:minimal /nr:false /warnaserror /p:TreatWarningsAsErrors=true /p:ContinuousIntegrationBuild=true /build/dotnet-8.0.122/artifacts/source-built-sdks/Microsoft.DotNet.Arcade.Sdk/tools/Build.proj /bl:"/build/dotnet-8.0.122/src/source-build-externals/artifacts/log/Release/Build.binlog" /p:Configuration=Release /p:RepoRoot=/build/dotnet-8.0.122/src/source-build-externals/ /p:Restore=true /p:Build=true /p:ArcadeBuil…
      0 Warning(s)
      1 Error(s)
  Time Elapsed 00:00:45.60
  Build failed with exit code 1. Check errors above.
  'source-build-externals' failed during build.
  See '/build/dotnet-8.0.122/artifacts/logs/source-build-externals.log' for more information.
  'dotnet' failed during build.
failed checks.x86_64-linux.devShell 5m 58s
dotnet-stage0-vmr-8.0.22: /build/dotnet-8.0.122/artifacts/source-built-sdks/Microsoft.DotNet.Arcade.Sdk/tools/SourceBuild/SourceBuildArcadeBuild.targets(207,5 …
dotnet-stage0-vmr-8.0.22:
  /build/dotnet-8.0.122/artifacts/source-built-sdks/Microsoft.DotNet.Arcade.Sdk/tools/SourceBuild/SourceBuildArcadeBuild.targets(207,5): error MSB3073: The command "/build/dotnet-8.0.122/.dotnet//dotnet msbuild /m /nologo /clp:Summary /v:minimal /nr:false /warnaserror /p:TreatWarningsAsErrors=true /p:ContinuousIntegrationBuild=true /build/dotnet-8.0.122/artifacts/source-built-sdks/Microsoft.DotNet.Arcade.Sdk/tools/Build.proj /bl:"/build/dotnet-8.0.122/src/source-build-externals/artifacts/log/Release/Build.binlog" /p:Configuration=Release /p:RepoRoot=/build/dotnet-8.0.122/src/source-build-externals/ /p:Restore=true /p:Build=true /p:ArcadeBuil…
      0 Warning(s)
      1 Error(s)
  Time Elapsed 00:00:17.12
  Build failed with exit code 1. Check errors above.
  'source-build-externals' failed during build.
  See '/build/dotnet-8.0.122/artifacts/logs/source-build-externals.log' for more information.
  'dotnet' failed during build.
failed checks.x86_64-linux.pre-commit 2m 59s
dotnet-stage0-vmr-8.0.22: /build/dotnet-8.0.122/artifacts/source-built-sdks/Microsoft.DotNet.Arcade.Sdk/tools/SourceBuild/SourceBuildArcadeBuild.targets(207,5 …
dotnet-stage0-vmr-8.0.22:
  /build/dotnet-8.0.122/artifacts/source-built-sdks/Microsoft.DotNet.Arcade.Sdk/tools/SourceBuild/SourceBuildArcadeBuild.targets(207,5): error MSB3073: The command "/build/dotnet-8.0.122/.dotnet//dotnet msbuild /m /nologo /clp:Summary /v:minimal /nr:false /warnaserror /p:TreatWarningsAsErrors=true /p:ContinuousIntegrationBuild=true /build/dotnet-8.0.122/artifacts/source-built-sdks/Microsoft.DotNet.Arcade.Sdk/tools/Build.proj /bl:"/build/dotnet-8.0.122/src/source-build-externals/artifacts/log/Release/Build.binlog" /p:Configuration=Release /p:RepoRoot=/build/dotnet-8.0.122/src/source-build-externals/ /p:Restore=true /p:Build=true /p:ArcadeBuil…
      0 Warning(s)
      1 Error(s)
  Time Elapsed 00:00:17.30
  Build failed with exit code 1. Check errors above.
  'source-build-externals' failed during build.
  See '/build/dotnet-8.0.122/artifacts/logs/source-build-externals.log' for more information.
  'dotnet' failed during build.
132 succeeded
succeeded attributes
status attribute duration
loading…