setup
checks.aarch64-linux.devShell
· build #520
· raw
1these 14 derivations will be built:2 /nix/store/faxd780c5agczkj8licsiv1syly2gbi1-dotnet-stage0-vmr-8.0.22.drv3 /nix/store/cr5cfwkl6irq13p1skg0nqfxw0k7jgfy-dotnet-stage0-sdk-8.0.122.drv4 /nix/store/ghq102mjmg1l6vhqsrzsqcwjc7bkcf6n-dotnet-vmr-8.0.22.drv5 /nix/store/07h4bsvnk2jzzkj1dwfgawf67f9ip47c-dotnet-aspnetcore-runtime-8.0.22.drv6 /nix/store/3drxg5w884i8xjdfr5wbs6axd76fcv0h-dotnet-runtime-8.0.22.drv7 /nix/store/r4wh5fcbd41da6kjn4d709vwm2h7vlyj-dotnet-runtime-wrapped-8.0.22.drv8 /nix/store/zssn1ns2hr7hbpb9sab2ixg2k2nkgbfw-dotnet-aspnetcore-runtime-wrapped-8.0.22.drv9 /nix/store/vhbhs03h1qh5r2fy5sbk0r8cmnn6y90m-dotnet-sdk-8.0.416.drv10 /nix/store/nipn3wglh0ab40yq3mw3535yy4g43lvw-dotnet-sdk-wrapped-8.0.416.drv11 /nix/store/c8pgxpacf95rzc7xknl8fzlsidf0y2nd-pre-commit-4.5.1.drv12 /nix/store/q8p4rlm7p769dmbd65b0hcvikfvw1lkz-pre-commit-config.json.drv13 /nix/store/fd33vq1w8pvzlgnbm58l3zn8qa6bgr3i-devshell-env.bash.drv14 /nix/store/r8g508qg3jdkxc1f3nn6v9d7zgyylkw2-devshell-dir.drv15 /nix/store/k3q0663naqychiabxxqnwcc0l6223cf8-devshell.drv16error: build of '/nix/store/faxd780c5agczkj8licsiv1syly2gbi1-dotnet-stage0-vmr-8.0.22.drv' on 'ssh-ng://nixbot-remote-build@78.232.36.247' failed: Cannot build '/nix/store/faxd780c5agczkj8licsiv1syly2gbi1-dotnet-stage0-vmr-8.0.22.drv'.17 Reason: builder failed with exit code 1.18 Output paths:19 /nix/store/9jysydyd169bbf6pbp2zp26yyzgyzvv8-dotnet-stage0-vmr-8.0.22-man20 /nix/store/makvsav7nd8r9xsw9x50nrl87q83j9gy-dotnet-stage0-vmr-8.0.22-debug21 /nix/store/pc6l6y1982y1knfin5v0crw68dybsiwn-dotnet-stage0-vmr-8.0.2222 Last 25 log lines:23 > [18:04:46.71] Packaging 'newtonsoft-json'...done24 > [18:04:52.16] Building 'xunit'...done25 >26 > Build FAILED.27 >28 > /build/dotnet-8.0.122/src/source-build-externals/artifacts/source-build/self/src/repo-projects/azure-activedirectory-identitymodel-extensions-for-dotnet.proj(35,5): error MSB3073: The command "/build/dotnet-8.0.122/.dotnet/dotnet build /bl:build.binlog /build/dotnet-8.0.122/src/source-build-externals/artifacts/source-build/self/src/src/azure-activedirectory-identitymodel-extensions-for-dotnet/src/System.IdentityModel.Tokens.Jwt/System.IdentityModel.Tokens.Jwt.csproj /p:Configuration=Release /v:minimal >> /build/dotnet-8.0.122/src/source-build-externals/artifacts/source-build/self/src/artifacts/bin/azure-activedirectory-identitymodel-extensions-for-dotnet/logs/azure-activedirectory-identitymodel-extensions-for-dotnet.log 2>&1 /p:Version=7.1.2" exited with code 1.29 > 0 Warning(s)30 > 1 Error(s)31 >32 > Time Elapsed 00:00:31.8233 > /build/dotnet-8.0.122/artifacts/source-built-sdks/Microsoft.DotNet.Arcade.Sdk/tools/SourceBuild/SourceBuildArcadeBuild.targets(207,5): error MSB3073: The command "/build/dotnet-8.0.122/.dotnet//dotnet msbuild /m /nologo /clp:Summary /v:minimal /nr:false /warnaserror /p:TreatWarningsAsErrors=true /p:ContinuousIntegrationBuild=true /build/dotnet-8.0.122/artifacts/source-built-sdks/Microsoft.DotNet.Arcade.Sdk/tools/Build.proj /bl:"/build/dotnet-8.0.122/src/source-build-externals/artifacts/log/Release/Build.binlog" /p:Configuration=Release /p:RepoRoot=/build/dotnet-8.0.122/src/source-build-externals/ /p:Restore=true /p:Build=true /p:ArcadeBuildFromSource=false /p:Rebuild=false /p:Test=false /p:Pack=true /p:IntegrationTest=false /p:PerformanceTest=false /p:Sign=false /p:Publish=true /p:ArcadeBuildFromSource=true /p:CopyWipIntoInnerSourceBuildRepo=true /p:DotNetBuildOffline=true /p:CopySrcInsteadOfClone=true /p:DotNetPackageVersionPropsPath=/build/dotnet-8.0.122/artifacts/obj/arm64/Release/PackageVersions.source-build-externals.props /p:AdditionalSourceBuiltNupkgCacheDir=/build/dotnet-8.0.122/artifacts/obj/arm64/Release/blob-feed/packages/ /p:ReferencePackageNupkgCacheDir=/build/dotnet-8.0.122/prereqs/packages/reference/ /p:PreviouslySourceBuiltNupkgCacheDir=/nix/store/4wv493dricb7sm1zz27n24n0j86d3j4r-Private.SourceBuilt.Artifacts.8.0.121-servicing.25476.1.centos.9-x64/ /p:SourceBuildUseMonoRuntime= /v:minimal -logger:/build/dotnet-8.0.122/artifacts/source-built-sdks/Microsoft.DotNet.Arcade.Sdk/tools/net8.0/Microsoft.DotNet.ArcadeLogging.dll /p:ArcadeInnerBuildFromSource=true /p:DotNetBuildFromSource=true /p:RepoRoot=/build/dotnet-8.0.122/src/source-build-externals/artifacts/source-build/self/src/ /p:ArtifactsDir=/build/dotnet-8.0.122/src/source-build-externals/artifacts/source-build/self/src/artifacts/ /bl:/build/dotnet-8.0.122/src/source-build-externals/artifacts/source-build/self/src/artifacts/sourcebuild.binlog /p:ContinuousIntegrationBuild=true /p:SourceBuildOutputDir=/build/dotnet-8.0.122/src/source-build-externals/artifacts/source-build/ /p:SourceBuiltBlobFeedDir= /p:DotNetBuildOffline=true /p:DotNetPackageVersionPropsPath=/build/dotnet-8.0.122/artifacts/obj/arm64/Release/PackageVersions.source-build-externals.props /p:FullAssemblySigningSupported=false" exited with code 1. [/build/dotnet-8.0.122/artifacts/source-built-sdks/Microsoft.DotNet.Arcade.Sdk/tools/Build.proj]34 > ##vso[task.logissue type=error;sourcepath=/build/dotnet-8.0.122/artifacts/source-built-sdks/Microsoft.DotNet.Arcade.Sdk/tools/SourceBuild/SourceBuildArcadeBuild.targets;linenumber=207;columnnumber=5;code=MSB3073;]The command "/build/dotnet-8.0.122/.dotnet//dotnet msbuild /m /nologo /clp:Summary /v:minimal /nr:false /warnaserror /p:TreatWarningsAsErrors=true /p:ContinuousIntegrationBuild=true /build/dotnet-8.0.122/artifacts/source-built-sdks/Microsoft.DotNet.Arcade.Sdk/tools/Build.proj /bl:"/build/dotnet-8.0.122/src/source-build-externals/artifacts/log/Release/Build.binlog" /p:Configuration=Release /p:RepoRoot=/build/dotnet-8.0.122/src/source-build-externals/ /p:Restore=true /p:Build=true /p:ArcadeBuildFromSource=false /p:Rebuild=false /p:Test=false /p:Pack=true /p:IntegrationTest=false /p:PerformanceTest=false /p:Sign=false /p:Publish=true /p:ArcadeBuildFromSource=true /p:CopyWipIntoInnerSourceBuildRepo=true /p:DotNetBuildOffline=true /p:CopySrcInsteadOfClone=true /p:DotNetPackageVersionPropsPath=/build/dotnet-8.0.122/artifacts/obj/arm64/Release/PackageVersions.source-build-externals.props /p:AdditionalSourceBuiltNupkgCacheDir=/build/dotnet-8.0.122/artifacts/obj/arm64/Release/blob-feed/packages/ /p:ReferencePackageNupkgCacheDir=/build/dotnet-8.0.122/prereqs/packages/reference/ /p:PreviouslySourceBuiltNupkgCacheDir=/nix/store/4wv493dricb7sm1zz27n24n0j86d3j4r-Private.SourceBuilt.Artifacts.8.0.121-servicing.25476.1.centos.9-x64/ /p:SourceBuildUseMonoRuntime= /v:minimal -logger:/build/dotnet-8.0.122/artifacts/source-built-sdks/Microsoft.DotNet.Arcade.Sdk/tools/net8.0/Microsoft.DotNet.ArcadeLogging.dll /p:ArcadeInnerBuildFromSource=true /p:DotNetBuildFromSource=true /p:RepoRoot=/build/dotnet-8.0.122/src/source-build-externals/artifacts/source-build/self/src/ /p:ArtifactsDir=/build/dotnet-8.0.122/src/source-build-externals/artifacts/source-build/self/src/artifacts/ /bl:/build/dotnet-8.0.122/src/source-build-externals/artifacts/source-build/self/src/artifacts/sourcebuild.binlog /p:ContinuousIntegrationBuild=true /p:SourceBuildOutputDir=/build/dotnet-8.0.122/src/source-build-externals/artifacts/source-build/ /p:SourceBuiltBlobFeedDir= /p:DotNetBuildOffline=true /p:DotNetPackageVersionPropsPath=/build/dotnet-8.0.122/artifacts/obj/arm64/Release/PackageVersions.source-build-externals.props /p:FullAssemblySigningSupported=false" exited with code 1.35 >36 > Build FAILED.37 >38 > /build/dotnet-8.0.122/artifacts/source-built-sdks/Microsoft.DotNet.Arcade.Sdk/tools/SourceBuild/SourceBuildArcadeBuild.targets(207,5): error MSB3073: The command "/build/dotnet-8.0.122/.dotnet//dotnet msbuild /m /nologo /clp:Summary /v:minimal /nr:false /warnaserror /p:TreatWarningsAsErrors=true /p:ContinuousIntegrationBuild=true /build/dotnet-8.0.122/artifacts/source-built-sdks/Microsoft.DotNet.Arcade.Sdk/tools/Build.proj /bl:"/build/dotnet-8.0.122/src/source-build-externals/artifacts/log/Release/Build.binlog" /p:Configuration=Release /p:RepoRoot=/build/dotnet-8.0.122/src/source-build-externals/ /p:Restore=true /p:Build=true /p:ArcadeBuildFromSource=false /p:Rebuild=false /p:Test=false /p:Pack=true /p:IntegrationTest=false /p:PerformanceTest=false /p:Sign=false /p:Publish=true /p:ArcadeBuildFromSource=true /p:CopyWipIntoInnerSourceBuildRepo=true /p:DotNetBuildOffline=true /p:CopySrcInsteadOfClone=true /p:DotNetPackageVersionPropsPath=/build/dotnet-8.0.122/artifacts/obj/arm64/Release/PackageVersions.source-build-externals.props /p:AdditionalSourceBuiltNupkgCacheDir=/build/dotnet-8.0.122/artifacts/obj/arm64/Release/blob-feed/packages/ /p:ReferencePackageNupkgCacheDir=/build/dotnet-8.0.122/prereqs/packages/reference/ /p:PreviouslySourceBuiltNupkgCacheDir=/nix/store/4wv493dricb7sm1zz27n24n0j86d3j4r-Private.SourceBuilt.Artifacts.8.0.121-servicing.25476.1.centos.9-x64/ /p:SourceBuildUseMonoRuntime= /v:minimal -logger:/build/dotnet-8.0.122/artifacts/source-built-sdks/Microsoft.DotNet.Arcade.Sdk/tools/net8.0/Microsoft.DotNet.ArcadeLogging.dll /p:ArcadeInnerBuildFromSource=true /p:DotNetBuildFromSource=true /p:RepoRoot=/build/dotnet-8.0.122/src/source-build-externals/artifacts/source-build/self/src/ /p:ArtifactsDir=/build/dotnet-8.0.122/src/source-build-externals/artifacts/source-build/self/src/artifacts/ /bl:/build/dotnet-8.0.122/src/source-build-externals/artifacts/source-build/self/src/artifacts/sourcebuild.binlog /p:ContinuousIntegrationBuild=true /p:SourceBuildOutputDir=/build/dotnet-8.0.122/src/source-build-externals/artifacts/source-build/ /p:SourceBuiltBlobFeedDir= /p:DotNetBuildOffline=true /p:DotNetPackageVersionPropsPath=/build/dotnet-8.0.122/artifacts/obj/arm64/Release/PackageVersions.source-build-externals.props /p:FullAssemblySigningSupported=false" exited with code 1. [/build/dotnet-8.0.122/artifacts/source-built-sdks/Microsoft.DotNet.Arcade.Sdk/tools/Build.proj]39 > 0 Warning(s)40 > 1 Error(s)41 >42 > Time Elapsed 00:00:34.1243 > Build failed with exit code 1. Check errors above.44 >45 > 'source-build-externals' failed during build.46 > See '/build/dotnet-8.0.122/artifacts/logs/source-build-externals.log' for more information.47 > 'dotnet' failed during build.48 For full logs, run:49 nix log /nix/store/faxd780c5agczkj8licsiv1syly2gbi1-dotnet-stage0-vmr-8.0.22.drv50error: Cannot build '/nix/store/faxd780c5agczkj8licsiv1syly2gbi1-dotnet-stage0-vmr-8.0.22.drv'.51 Reason: builder failed with exit code 1.52 Output paths:53 /nix/store/9jysydyd169bbf6pbp2zp26yyzgyzvv8-dotnet-stage0-vmr-8.0.22-man54 /nix/store/makvsav7nd8r9xsw9x50nrl87q83j9gy-dotnet-stage0-vmr-8.0.22-debug55 /nix/store/pc6l6y1982y1knfin5v0crw68dybsiwn-dotnet-stage0-vmr-8.0.2256error: Cannot build '/nix/store/cr5cfwkl6irq13p1skg0nqfxw0k7jgfy-dotnet-stage0-sdk-8.0.122.drv'.57 Reason: 1 dependency failed.58 Output paths:59 /nix/store/0bblgl0c8kf3adl5xyrrw5m4ch0lsmja-dotnet-stage0-sdk-8.0.122-man60 /nix/store/gpx8261yphdxik5hwx9nrz8m9qzpd9jz-dotnet-stage0-sdk-8.0.12261 /nix/store/nfzgqsbmgz48mvjq90iaiybzr21myxwk-dotnet-stage0-sdk-8.0.122-artifacts62error: Cannot build '/nix/store/ghq102mjmg1l6vhqsrzsqcwjc7bkcf6n-dotnet-vmr-8.0.22.drv'.63 Reason: 1 dependency failed.64 Output paths:65 /nix/store/b3ihjqq8sn6ia9b1rs8yfkk0ckz3a4pv-dotnet-vmr-8.0.2266 /nix/store/pkdq4sdpw7kd9lf8wnch1fpvahssyjls-dotnet-vmr-8.0.22-debug67 /nix/store/y4w7zfza120a69xvy3x8lw01ilq50964-dotnet-vmr-8.0.22-man68error: Cannot build '/nix/store/07h4bsvnk2jzzkj1dwfgawf67f9ip47c-dotnet-aspnetcore-runtime-8.0.22.drv'.69 Reason: 1 dependency failed.70 Output paths:71 /nix/store/9mms9qv4zik86lddacb350sfx1iasrjp-dotnet-aspnetcore-runtime-8.0.22-man72 /nix/store/fl8clinzgcbywknlaq5g96bv9jplw7hv-dotnet-aspnetcore-runtime-8.0.2273error: Cannot build '/nix/store/3drxg5w884i8xjdfr5wbs6axd76fcv0h-dotnet-runtime-8.0.22.drv'.74 Reason: 1 dependency failed.75 Output paths:76 /nix/store/6rvs82293bvfs5mv1ic6z9248g88n2x7-dotnet-runtime-8.0.2277 /nix/store/d1pv5n9k8j46nzw2ildvpz8v2m659byx-dotnet-runtime-8.0.22-man78error: Cannot build '/nix/store/zssn1ns2hr7hbpb9sab2ixg2k2nkgbfw-dotnet-aspnetcore-runtime-wrapped-8.0.22.drv'.79 Reason: 1 dependency failed.80 Output paths:81 /nix/store/0c5hckf4r0pz8gzac5w316r4y8ljznq8-dotnet-aspnetcore-runtime-wrapped-8.0.2282 /nix/store/68z4q7cwxn7radijak6frxwc6cp8pagm-dotnet-aspnetcore-runtime-wrapped-8.0.22-man83error: Cannot build '/nix/store/r4wh5fcbd41da6kjn4d709vwm2h7vlyj-dotnet-runtime-wrapped-8.0.22.drv'.84 Reason: 1 dependency failed.85 Output paths:86 /nix/store/7nssmw2vvfgzwa7m7hg9haj5x7z5sdal-dotnet-runtime-wrapped-8.0.22-man87 /nix/store/ms54ir31wzjyxjg394m087y9vzac0j7w-dotnet-runtime-wrapped-8.0.2288error: Cannot build '/nix/store/vhbhs03h1qh5r2fy5sbk0r8cmnn6y90m-dotnet-sdk-8.0.416.drv'.89 Reason: 2 dependencies failed.90 Output paths:91 /nix/store/ayax88q0gy0yll7qv6lb3y9i8xi2r87n-dotnet-sdk-8.0.41692error: Cannot build '/nix/store/nipn3wglh0ab40yq3mw3535yy4g43lvw-dotnet-sdk-wrapped-8.0.416.drv'.93 Reason: 1 dependency failed.94 Output paths:95 /nix/store/fas0zic7ax15c311rhb5q7lmwhsdwyhj-dotnet-sdk-wrapped-8.0.41696error: Cannot build '/nix/store/c8pgxpacf95rzc7xknl8fzlsidf0y2nd-pre-commit-4.5.1.drv'.97 Reason: 1 dependency failed.98 Output paths:99 /nix/store/qzdc908balqw2b0z2mjinskra0gqa4f4-pre-commit-4.5.1100 /nix/store/rssbz8w2r2x7xs6ppj0frb6x9py8jl94-pre-commit-4.5.1-dist101error: Cannot build '/nix/store/q8p4rlm7p769dmbd65b0hcvikfvw1lkz-pre-commit-config.json.drv'.102 Reason: 1 dependency failed.103 Output paths:104 /nix/store/91iimgq6z39nx61blym8hgd66rsp10sp-pre-commit-config.json105error: Cannot build '/nix/store/fd33vq1w8pvzlgnbm58l3zn8qa6bgr3i-devshell-env.bash.drv'.106 Reason: 2 dependencies failed.107 Output paths:108 /nix/store/jpaghpzqnyx4ahvd7bsi0y6lnwwybjz0-devshell-env.bash109error: Cannot build '/nix/store/r8g508qg3jdkxc1f3nn6v9d7zgyylkw2-devshell-dir.drv'.110 Reason: 2 dependencies failed.111 Output paths:112 /nix/store/b01dh5lbcsc6na79dwax0pbapz5kh2w7-devshell-dir113error: Cannot build '/nix/store/k3q0663naqychiabxxqnwcc0l6223cf8-devshell.drv'.114 Reason: 1 dependency failed.115 Output paths:116 /nix/store/nvhxm8s3f9akjxqi3qlhzwfgfl7p2nf6-devshell