nixbot

builds
1these 3 derivations will be built:2 /nix/store/s0wxyjr0ax4xfm8dy7nhypwj3z16wxr5-start-postgres-server-test.drv3 /nix/store/lwxfh56869p39iy6ak1p759wj1vd5wrq-postgres-15-check-harness.drv4 /nix/store/3zlw1x1n93j98vlgfdj2mkpvkw8gbkf7-run-check-harness-psql-15-slim.drv5error: Cannot build '/nix/store/3zlw1x1n93j98vlgfdj2mkpvkw8gbkf7-run-check-harness-psql-15-slim.drv'.6 Reason: builder failed with exit code 1.7 Output paths:8 /nix/store/f90xa83y5d02gr1yb92ca0i7dvd8mv5l-run-check-harness-psql-15-slim9 Last 25 log lines:10 > test supautils_warehouse_writer ... FAILED 12 ms11 > test vault ... FAILED 30 ms12 > test wal2json ... FAILED 15 ms13 > test z_15_ext_interface ... FAILED 689 ms14 > test z_15_intarray_ltree_query ... FAILED 11 ms15 > test z_15_pg_stat_monitor ... FAILED 10 ms16 > test z_15_pgjwt ... FAILED 17 ms17 > test z_15_pgvector ... FAILED 32 ms18 > test z_15_plv8 ... FAILED 47 ms19 > test z_15_roles ... FAILED 17 ms20 > test z_15_rum ... FAILED 19 ms21 > test z_15_timescale ... FAILED 24 ms22 > test z_15_unhype_timescale_to_partman ... FAILED 11932 ms23 >24 > ========================25 > 74 of 74 tests failed.26 > ========================27 >28 > The differences that caused some tests to fail can be viewed in the29 > file "/nix/store/f90xa83y5d02gr1yb92ca0i7dvd8mv5l-run-check-harness-psql-15-slim/regression_output/regression.diffs". A copy of the test summary that you see30 > above is saved in the file "/nix/store/f90xa83y5d02gr1yb92ca0i7dvd8mv5l-run-check-harness-psql-15-slim/regression_output/regression.out".31 >32 > 2026-10-27 10:51:50 [ERROR] pg_regress tests failed33 > 2026-10-27 10:51:50 [ERROR] An error occurred. Exit code: 134 > 2026-10-27 10:51:50 [ERROR] Debug logs:35 For full logs, run:36 nix log /nix/store/3zlw1x1n93j98vlgfdj2mkpvkw8gbkf7-run-check-harness-psql-15-slim.drv