setup
checks.aarch64-linux.psql_17_cli
· build #471
· raw
1these 3 derivations will be built:2 /nix/store/30ldqnmpksg7dwa4rd1ilmf38i0mh3y9-start-postgres-server-test.drv3 /nix/store/1s85kgpbv9kqqr332wmjap85hz5zrzdv-postgres-17-check-harness.drv4 /nix/store/p04x65rlc67i30i6gkb4k643f6gy0sl1-run-check-harness-psql-17-cli.drv5error: build of '/nix/store/p04x65rlc67i30i6gkb4k643f6gy0sl1-run-check-harness-psql-17-cli.drv' on 'ssh-ng://nixbot-remote-build@78.232.36.247' failed: Cannot build '/nix/store/p04x65rlc67i30i6gkb4k643f6gy0sl1-run-check-harness-psql-17-cli.drv'.6 Reason: builder failed with exit code 1.7 Output paths:8 /nix/store/3r0k3am2cgbx3jrayjv3pk88l82daasd-run-check-harness-psql-17-cli9 Last 25 log lines:10 > test pgaudit ... FAILED 329 ms11 > test pgbouncer ... FAILED 33 ms12 > test pgcrypto_cipher_matrix ... FAILED 31 ms13 > test pgsodium ... FAILED 15 ms14 > test realtime ... FAILED 11 ms15 > test replica_identity_upsert ... FAILED 17 ms16 > test storage ... FAILED 28 ms17 > test supautils_reserved_roles ... FAILED 11 ms18 > test supautils_warehouse_writer ... FAILED 16 ms19 > test vault ... FAILED 59 ms20 > test wal2json ... FAILED 61 ms21 > test z_17_intarray_ltree_query ... FAILED 71 ms22 > test z_17_wal_summarize ... FAILED 12 ms23 >24 > ========================25 > 38 of 38 tests failed.26 > ========================27 >28 > The differences that caused some tests to fail can be viewed in the29 > file "/nix/store/3r0k3am2cgbx3jrayjv3pk88l82daasd-run-check-harness-psql-17-cli/regression_output/regression.diffs". A copy of the test summary that you see30 > above is saved in the file "/nix/store/3r0k3am2cgbx3jrayjv3pk88l82daasd-run-check-harness-psql-17-cli/regression_output/regression.out".31 >32 > 2026-10-27 10:47:53 [ERROR] pg_regress tests failed33 > 2026-10-27 10:47:53 [ERROR] An error occurred. Exit code: 134 > 2026-10-27 10:47:53 [ERROR] Debug logs:35 For full logs, run:36 nix log /nix/store/p04x65rlc67i30i6gkb4k643f6gy0sl1-run-check-harness-psql-17-cli.drv37error: Cannot build '/nix/store/p04x65rlc67i30i6gkb4k643f6gy0sl1-run-check-harness-psql-17-cli.drv'.38 Reason: builder failed with exit code 1.39 Output paths:40 /nix/store/3r0k3am2cgbx3jrayjv3pk88l82daasd-run-check-harness-psql-17-cli