setup
checks.aarch64-linux.psql_15_slim
· build #471
· raw
1these 3 derivations will be built:2 /nix/store/vv48ilj5s161819w66p8jsf1ha5y97mv-start-postgres-server-test.drv3 /nix/store/5pl9iah1gka627y9lix3jp8ffhk0477h-postgres-15-check-harness.drv4 /nix/store/klkkddkg3489jdlkiha1fiw0530facbv-run-check-harness-psql-15-slim.drv5error: build of '/nix/store/klkkddkg3489jdlkiha1fiw0530facbv-run-check-harness-psql-15-slim.drv' on 'ssh-ng://nixbot-remote-build@78.232.36.247' failed: Cannot build '/nix/store/klkkddkg3489jdlkiha1fiw0530facbv-run-check-harness-psql-15-slim.drv'.6 Reason: builder failed with exit code 1.7 Output paths:8 /nix/store/i2pb8zlrgmk1rhlys2c7p7fys6mc1p7y-run-check-harness-psql-15-slim9 Last 25 log lines:10 > test supautils_warehouse_writer ... FAILED 16 ms11 > test vault ... FAILED 59 ms12 > test wal2json ... FAILED 53 ms13 > test z_15_ext_interface ... FAILED 1442 ms14 > test z_15_intarray_ltree_query ... FAILED 17 ms15 > test z_15_pg_stat_monitor ... FAILED 16 ms16 > test z_15_pgjwt ... FAILED 39 ms17 > test z_15_pgvector ... FAILED 84 ms18 > test z_15_plv8 ... FAILED 88 ms19 > test z_15_roles ... FAILED 26 ms20 > test z_15_rum ... FAILED 67 ms21 > test z_15_timescale ... FAILED 58 ms22 > test z_15_unhype_timescale_to_partman ... FAILED 21553 ms23 >24 > ========================25 > 74 of 74 tests failed.26 > ========================27 >28 > The differences that caused some tests to fail can be viewed in the29 > file "/nix/store/i2pb8zlrgmk1rhlys2c7p7fys6mc1p7y-run-check-harness-psql-15-slim/regression_output/regression.diffs". A copy of the test summary that you see30 > above is saved in the file "/nix/store/i2pb8zlrgmk1rhlys2c7p7fys6mc1p7y-run-check-harness-psql-15-slim/regression_output/regression.out".31 >32 > 2026-10-27 10:47:44 [ERROR] pg_regress tests failed33 > 2026-10-27 10:47:44 [ERROR] An error occurred. Exit code: 134 > 2026-10-27 10:47:44 [ERROR] Debug logs:35 For full logs, run:36 nix log /nix/store/klkkddkg3489jdlkiha1fiw0530facbv-run-check-harness-psql-15-slim.drv37error: Cannot build '/nix/store/klkkddkg3489jdlkiha1fiw0530facbv-run-check-harness-psql-15-slim.drv'.38 Reason: builder failed with exit code 1.39 Output paths:40 /nix/store/i2pb8zlrgmk1rhlys2c7p7fys6mc1p7y-run-check-harness-psql-15-slim