setup
checks.x86_64-linux.psql_17_slim
· build #462
· raw
1these 3 derivations will be built:2 /nix/store/9ifmmqp6b98jvajhnnflvnbyy837nrjz-start-postgres-server-test.drv3 /nix/store/076xcfq95ryp71wm49vyk02bdj67m1bn-postgres-17-check-harness.drv4 /nix/store/z9jbwzz6ypzfghjgybj9018q2706gvwx-run-check-harness-psql-17-slim.drv5error: Cannot build '/nix/store/z9jbwzz6ypzfghjgybj9018q2706gvwx-run-check-harness-psql-17-slim.drv'.6 Reason: builder failed with exit code 1.7 Output paths:8 /nix/store/b2k19faj8z6zpn3wa10a2hk7yn29dijl-run-check-harness-psql-17-slim9 Last 25 log lines:10 > test security ... FAILED 10 ms11 > test storage ... ok 15 ms12 > test supautils_reserved_roles ... ok 9 ms13 > test supautils_restrict_versions ... ok 78 ms14 > test vault ... ok 28 ms15 > test wal2json ... ok 16 ms16 > test z_17_ext_interface ... FAILED 105 ms17 > test z_17_intarray_ltree_query ... ok 15 ms18 > test z_17_pg_stat_monitor ... ok 9 ms19 > test z_17_pgvector ... ok 13 ms20 > test z_17_roles ... ok 13 ms21 > test z_17_rum ... ok 15 ms22 > test z_17_wal_summarize ... ok 8 ms23 >24 > =======================25 > 4 of 70 tests failed.26 > =======================27 >28 > The differences that caused some tests to fail can be viewed in the29 > file "/nix/store/b2k19faj8z6zpn3wa10a2hk7yn29dijl-run-check-harness-psql-17-slim/regression_output/regression.diffs". A copy of the test summary that you see30 > above is saved in the file "/nix/store/b2k19faj8z6zpn3wa10a2hk7yn29dijl-run-check-harness-psql-17-slim/regression_output/regression.out".31 >32 > 2026-10-26 12:46:58 [ERROR] pg_regress tests failed33 > 2026-10-26 12:46:59 [ERROR] An error occurred. Exit code: 134 > 2026-10-26 12:46:59 [ERROR] Debug logs:35 For full logs, run:36 nix log /nix/store/z9jbwzz6ypzfghjgybj9018q2706gvwx-run-check-harness-psql-17-slim.drv