setup
checks.x86_64-linux.psql_15_slim
· build #462
· raw
1these 3 derivations will be built:2 /nix/store/nmyanigr83vcrgzvg2bp1havr0h5jiaa-start-postgres-server-test.drv3 /nix/store/bkh8q905nblvfvhmxn5vcwslhlhgbirj-postgres-15-check-harness.drv4 /nix/store/i1xaxlwh8mbjr2cjyih977mavc33vx91-run-check-harness-psql-15-slim.drv5error: Cannot build '/nix/store/i1xaxlwh8mbjr2cjyih977mavc33vx91-run-check-harness-psql-15-slim.drv'.6 Reason: builder failed with exit code 1.7 Output paths:8 /nix/store/g8324h7mw4ih3mzmarmdx4a6756krjni-run-check-harness-psql-15-slim9 Last 25 log lines:10 > test supautils_restrict_versions ... ok 80 ms11 > test vault ... ok 28 ms12 > test wal2json ... ok 18 ms13 > test z_15_ext_interface ... FAILED 629 ms14 > test z_15_intarray_ltree_query ... ok 11 ms15 > test z_15_pg_stat_monitor ... ok 11 ms16 > test z_15_pgjwt ... ok 19 ms17 > test z_15_pgvector ... ok 35 ms18 > test z_15_plv8 ... ok 48 ms19 > test z_15_roles ... ok 16 ms20 > test z_15_rum ... ok 19 ms21 > test z_15_timescale ... ok 22 ms22 > test z_15_unhype_timescale_to_partman ... ok 12103 ms23 >24 > =======================25 > 4 of 73 tests failed.26 > =======================27 >28 > The differences that caused some tests to fail can be viewed in the29 > file "/nix/store/g8324h7mw4ih3mzmarmdx4a6756krjni-run-check-harness-psql-15-slim/regression_output/regression.diffs". A copy of the test summary that you see30 > above is saved in the file "/nix/store/g8324h7mw4ih3mzmarmdx4a6756krjni-run-check-harness-psql-15-slim/regression_output/regression.out".31 >32 > 2026-10-26 12:45:09 [ERROR] pg_regress tests failed33 > 2026-10-26 12:45:09 [ERROR] An error occurred. Exit code: 134 > 2026-10-26 12:45:09 [ERROR] Debug logs:35 For full logs, run:36 nix log /nix/store/i1xaxlwh8mbjr2cjyih977mavc33vx91-run-check-harness-psql-15-slim.drv