setup
checks.aarch64-linux.psql_15_slim
· build #462
· raw
1these 3 derivations will be built:2 /nix/store/wb4qkqccpksxxqd8lfqax5xpw9rcibpk-start-postgres-server-test.drv3 /nix/store/by9q2y4s6mygjqy6rbh66icwyac4s2a1-postgres-15-check-harness.drv4 /nix/store/f5yamvnh8mg0ibp965rgpgln8rwcva85-run-check-harness-psql-15-slim.drv5error: build of '/nix/store/f5yamvnh8mg0ibp965rgpgln8rwcva85-run-check-harness-psql-15-slim.drv' on 'ssh-ng://nixbot-remote-build@78.232.36.247' failed: Cannot build '/nix/store/f5yamvnh8mg0ibp965rgpgln8rwcva85-run-check-harness-psql-15-slim.drv'.6 Reason: builder failed with exit code 1.7 Output paths:8 /nix/store/xnjhp1gsr8liwfh3dyz3j0cms8lbn5ai-run-check-harness-psql-15-slim9 Last 25 log lines:10 > test supautils_restrict_versions ... ok 193 ms11 > test vault ... ok 58 ms12 > test wal2json ... ok 50 ms13 > test z_15_ext_interface ... FAILED 1323 ms14 > test z_15_intarray_ltree_query ... ok 16 ms15 > test z_15_pg_stat_monitor ... ok 16 ms16 > test z_15_pgjwt ... ok 31 ms17 > test z_15_pgvector ... ok 93 ms18 > test z_15_plv8 ... ok 86 ms19 > test z_15_roles ... ok 23 ms20 > test z_15_rum ... ok 49 ms21 > test z_15_timescale ... ok 53 ms22 > test z_15_unhype_timescale_to_partman ... ok 19821 ms23 >24 > =======================25 > 4 of 73 tests failed.26 > =======================27 >28 > The differences that caused some tests to fail can be viewed in the29 > file "/nix/store/xnjhp1gsr8liwfh3dyz3j0cms8lbn5ai-run-check-harness-psql-15-slim/regression_output/regression.diffs". A copy of the test summary that you see30 > above is saved in the file "/nix/store/xnjhp1gsr8liwfh3dyz3j0cms8lbn5ai-run-check-harness-psql-15-slim/regression_output/regression.out".31 >32 > 2026-10-26 12:42:22 [ERROR] pg_regress tests failed33 > 2026-10-26 12:42:23 [ERROR] An error occurred. Exit code: 134 > 2026-10-26 12:42:23 [ERROR] Debug logs:35 For full logs, run:36 nix log /nix/store/f5yamvnh8mg0ibp965rgpgln8rwcva85-run-check-harness-psql-15-slim.drv37error: Cannot build '/nix/store/f5yamvnh8mg0ibp965rgpgln8rwcva85-run-check-harness-psql-15-slim.drv'.38 Reason: builder failed with exit code 1.39 Output paths:40 /nix/store/xnjhp1gsr8liwfh3dyz3j0cms8lbn5ai-run-check-harness-psql-15-slim