setup
checks.aarch64-linux.psql_17_slim
· build #459
· raw
1these 13 derivations will be built:2 /nix/store/49bk2dfnqc74pncych0p8bgmkps1lpy9-supabase_vault-0.3.1.drv3 /nix/store/4hxpgqmsb2sjvli9vy0g1gmkba2cjqkr-supabase_vault-0.3.2.drv4 /nix/store/shz51gbgrpgfsjnnnmvq9d245pyzfa6l-supabase_vault-0.3.2.drv5 /nix/store/h8d63a8ixy8sd88yjgrr0a7vl5nxp7i1-supabase_vault.drv6 /nix/store/5h9a34l6618mlmbaz42hc552aa6qqa1p-postgresql-and-plugins-17_22.drv7 /nix/store/rgqvlh0ms8c90mkwlkjxkfhb3b4hxs7q-postgresql-and-plugins-17_22.drv8 /nix/store/pmbs4qldaahhypd0342i9rwr5apm6f0m-supabase_vault-0.3.1.drv9 /nix/store/ghz3rrll3bfm4g453fy1i87yyy3i79xz-supabase_vault.drv10 /nix/store/jjykga8vcld2chxicrlsjj74x1z78rm8-postgresql-and-plugins-17.11.drv11 /nix/store/v0njh2mlvny48lylwvgkj92cjbqjamfj-postgresql-and-plugins-17.11.drv12 /nix/store/v7al709nlwd3wwicnnlh516l9p319095-start-postgres-server-test.drv13 /nix/store/p03i94g6ym8ymzca3wid5aaxml35vzlm-postgres-17-check-harness.drv14 /nix/store/9qn2q22msqns04jijdq8sps527hs7qjd-run-check-harness-psql-17-slim.drv15error: build of '/nix/store/9qn2q22msqns04jijdq8sps527hs7qjd-run-check-harness-psql-17-slim.drv' on 'ssh-ng://nixbot-remote-build@78.232.36.247' failed: Cannot build '/nix/store/9qn2q22msqns04jijdq8sps527hs7qjd-run-check-harness-psql-17-slim.drv'.16 Reason: builder failed with exit code 1.17 Output paths:18 /nix/store/a0zv7pd870rwb287nsb0gr4y21rr4ywz-run-check-harness-psql-17-slim19 Last 25 log lines:20 > test security ... FAILED 14 ms21 > test storage ... ok 26 ms22 > test supautils_reserved_roles ... ok 12 ms23 > test supautils_restrict_versions ... ok 174 ms24 > test vault ... ok 77 ms25 > test wal2json ... ok 61 ms26 > test z_17_ext_interface ... FAILED 157 ms27 > test z_17_intarray_ltree_query ... ok 20 ms28 > test z_17_pg_stat_monitor ... ok 11 ms29 > test z_17_pgvector ... ok 39 ms30 > test z_17_roles ... ok 22 ms31 > test z_17_rum ... ok 38 ms32 > test z_17_wal_summarize ... ok 12 ms33 >34 > =======================35 > 6 of 70 tests failed.36 > =======================37 >38 > The differences that caused some tests to fail can be viewed in the39 > file "/nix/store/a0zv7pd870rwb287nsb0gr4y21rr4ywz-run-check-harness-psql-17-slim/regression_output/regression.diffs". A copy of the test summary that you see40 > above is saved in the file "/nix/store/a0zv7pd870rwb287nsb0gr4y21rr4ywz-run-check-harness-psql-17-slim/regression_output/regression.out".41 >42 > 2026-10-26 11:36:53 [ERROR] pg_regress tests failed43 > 2026-10-26 11:36:54 [ERROR] An error occurred. Exit code: 144 > 2026-10-26 11:36:54 [ERROR] Debug logs:45 For full logs, run:46 nix log /nix/store/9qn2q22msqns04jijdq8sps527hs7qjd-run-check-harness-psql-17-slim.drv47error: Cannot build '/nix/store/9qn2q22msqns04jijdq8sps527hs7qjd-run-check-harness-psql-17-slim.drv'.48 Reason: builder failed with exit code 1.49 Output paths:50 /nix/store/a0zv7pd870rwb287nsb0gr4y21rr4ywz-run-check-harness-psql-17-slim