nixbot

builds
1this derivation will be built:2 /nix/store/0q27cbrpd0sb4vkklvhjpl1jpgwisvc5-run-check-harness-psql-15.drv3these 2 paths will be fetched (23.1 KiB download, 91.6 KiB unpacked):4 /nix/store/ngkc2zc0rs9np7rax3zacv80f639aha5-postgres-15-check-harness5 /nix/store/rzyi64nvhv8cy9pn2d38l9ba0zlxidrw-start-postgres-server-test6error: Cannot build '/nix/store/0q27cbrpd0sb4vkklvhjpl1jpgwisvc5-run-check-harness-psql-15.drv'.7 Reason: builder failed with exit code 1.8 Output paths:9 /nix/store/0v8wrdal0dfdl7i942g9q561vn5w2fzy-run-check-harness-psql-1510 Last 25 log lines:11 > test supautils_restrict_versions ... ok 84 ms12 > test vault ... ok 30 ms13 > test wal2json ... ok 15 ms14 > test z_15_ext_interface ... ok 637 ms15 > test z_15_intarray_ltree_query ... ok 11 ms16 > test z_15_pg_stat_monitor ... ok 11 ms17 > test z_15_pgjwt ... ok 19 ms18 > test z_15_pgvector ... ok 33 ms19 > test z_15_plv8 ... ok 50 ms20 > test z_15_roles ... ok 18 ms21 > test z_15_rum ... ok 17 ms22 > test z_15_timescale ... ok 24 ms23 > test z_15_unhype_timescale_to_partman ... ok 11762 ms24 >25 > =======================26 > 1 of 73 tests failed.27 > =======================28 >29 > The differences that caused some tests to fail can be viewed in the30 > file "/nix/store/0v8wrdal0dfdl7i942g9q561vn5w2fzy-run-check-harness-psql-15/regression_output/regression.diffs". A copy of the test summary that you see31 > above is saved in the file "/nix/store/0v8wrdal0dfdl7i942g9q561vn5w2fzy-run-check-harness-psql-15/regression_output/regression.out".32 >33 > 2026-10-26 08:32:05 [ERROR] pg_regress tests failed34 > 2026-10-26 08:32:05 [ERROR] An error occurred. Exit code: 135 > 2026-10-26 08:32:05 [ERROR] Debug logs:36 For full logs, run:37 nix log /nix/store/0q27cbrpd0sb4vkklvhjpl1jpgwisvc5-run-check-harness-psql-15.drv