setup
checks.aarch64-linux.psql_17_slim
· build #452
· raw
1these 3 derivations will be built:2 /nix/store/arva4nl3irvvxxh2gihxq4rllkcxnh7w-start-postgres-server-test.drv3 /nix/store/2gry3cc96ygxa52mh88yslwks6g12y5d-postgres-17-check-harness.drv4 /nix/store/ahqqmn4v1jnpc6vv4x71zjv7vb30hl8v-run-check-harness-psql-17-slim.drv5error: build of '/nix/store/ahqqmn4v1jnpc6vv4x71zjv7vb30hl8v-run-check-harness-psql-17-slim.drv' on 'ssh-ng://nixbot-remote-build@78.232.36.247' failed: Cannot build '/nix/store/ahqqmn4v1jnpc6vv4x71zjv7vb30hl8v-run-check-harness-psql-17-slim.drv'.6 Reason: builder failed with exit code 1.7 Output paths:8 /nix/store/8fj856iqlg2b45fya72i0yxzj74nmymc-run-check-harness-psql-17-slim9 Last 25 log lines:10 > test roles ... FAILED 22 ms11 > test security ... ok 16 ms12 > test storage ... ok 76 ms13 > test supautils_reserved_roles ... ok 12 ms14 > test supautils_restrict_versions ... ok 140 ms15 > test vault ... ok 51 ms16 > test wal2json ... ok 44 ms17 > test z_17_ext_interface ... ok 161 ms18 > test z_17_intarray_ltree_query ... ok 19 ms19 > test z_17_pg_stat_monitor ... ok 11 ms20 > test z_17_pgvector ... ok 25 ms21 > test z_17_roles ... ok 23 ms22 > test z_17_rum ... ok 31 ms23 >24 > =======================25 > 1 of 69 tests failed.26 > =======================27 >28 > The differences that caused some tests to fail can be viewed in the29 > file "/nix/store/8fj856iqlg2b45fya72i0yxzj74nmymc-run-check-harness-psql-17-slim/regression_output/regression.diffs". A copy of the test summary that you see30 > above is saved in the file "/nix/store/8fj856iqlg2b45fya72i0yxzj74nmymc-run-check-harness-psql-17-slim/regression_output/regression.out".31 >32 > 2026-10-26 08:30:18 [ERROR] pg_regress tests failed33 > 2026-10-26 08:30:18 [ERROR] An error occurred. Exit code: 134 > 2026-10-26 08:30:18 [ERROR] Debug logs:35 For full logs, run:36 nix log /nix/store/ahqqmn4v1jnpc6vv4x71zjv7vb30hl8v-run-check-harness-psql-17-slim.drv37error: Cannot build '/nix/store/ahqqmn4v1jnpc6vv4x71zjv7vb30hl8v-run-check-harness-psql-17-slim.drv'.38 Reason: builder failed with exit code 1.39 Output paths:40 /nix/store/8fj856iqlg2b45fya72i0yxzj74nmymc-run-check-harness-psql-17-slim