setup
checks.aarch64-linux.psql_17
· build #452
· raw
1these 3 derivations will be built:2 /nix/store/kfhgkghzbzqlb5masizgsw63qyn4p1sp-start-postgres-server-test.drv3 /nix/store/b7qckbw3gxdpndxwwji0b0qq395c4l44-postgres-17-check-harness.drv4 /nix/store/pjnrs92kww9ki1ybd13grgf6994lvqcd-run-check-harness-psql-17.drv5error: build of '/nix/store/pjnrs92kww9ki1ybd13grgf6994lvqcd-run-check-harness-psql-17.drv' on 'ssh-ng://nixbot-remote-build@78.232.36.247' failed: Cannot build '/nix/store/pjnrs92kww9ki1ybd13grgf6994lvqcd-run-check-harness-psql-17.drv'.6 Reason: builder failed with exit code 1.7 Output paths:8 /nix/store/3ypz3i8ca512mbh8dw46b4xgzlrjbjh7-run-check-harness-psql-179 Last 25 log lines:10 > test roles ... FAILED 21 ms11 > test security ... ok 15 ms12 > test storage ... ok 30 ms13 > test supautils_reserved_roles ... ok 12 ms14 > test supautils_restrict_versions ... ok 142 ms15 > test vault ... ok 47 ms16 > test wal2json ... ok 45 ms17 > test z_17_ext_interface ... ok 161 ms18 > test z_17_intarray_ltree_query ... ok 19 ms19 > test z_17_pg_stat_monitor ... ok 11 ms20 > test z_17_pgvector ... ok 27 ms21 > test z_17_roles ... ok 23 ms22 > test z_17_rum ... ok 30 ms23 >24 > =======================25 > 1 of 69 tests failed.26 > =======================27 >28 > The differences that caused some tests to fail can be viewed in the29 > file "/nix/store/3ypz3i8ca512mbh8dw46b4xgzlrjbjh7-run-check-harness-psql-17/regression_output/regression.diffs". A copy of the test summary that you see30 > above is saved in the file "/nix/store/3ypz3i8ca512mbh8dw46b4xgzlrjbjh7-run-check-harness-psql-17/regression_output/regression.out".31 >32 > 2026-10-26 08:28:26 [ERROR] pg_regress tests failed33 > 2026-10-26 08:28:26 [ERROR] An error occurred. Exit code: 134 > 2026-10-26 08:28:26 [ERROR] Debug logs:35 For full logs, run:36 nix log /nix/store/pjnrs92kww9ki1ybd13grgf6994lvqcd-run-check-harness-psql-17.drv37error: Cannot build '/nix/store/pjnrs92kww9ki1ybd13grgf6994lvqcd-run-check-harness-psql-17.drv'.38 Reason: builder failed with exit code 1.39 Output paths:40 /nix/store/3ypz3i8ca512mbh8dw46b4xgzlrjbjh7-run-check-harness-psql-17