setup
checks.aarch64-linux.psql_15_slim
· build #452
· raw
1these 3 derivations will be built:2 /nix/store/7wcg0dj8zsvhgmzkhk50lnsibyihxjqn-start-postgres-server-test.drv3 /nix/store/ypbd0cdz30ciycz7sd2gz8kwzq61rjdk-postgres-15-check-harness.drv4 /nix/store/4ppyn86vw7llp287hbxi78717jarqzp4-run-check-harness-psql-15-slim.drv5error: build of '/nix/store/4ppyn86vw7llp287hbxi78717jarqzp4-run-check-harness-psql-15-slim.drv' on 'ssh-ng://nixbot-remote-build@78.232.36.247' failed: Cannot build '/nix/store/4ppyn86vw7llp287hbxi78717jarqzp4-run-check-harness-psql-15-slim.drv'.6 Reason: builder failed with exit code 1.7 Output paths:8 /nix/store/bv4a5zax4z0x0zx4fbxvq4lgw5lc64df-run-check-harness-psql-15-slim9 Last 25 log lines:10 > test supautils_restrict_versions ... ok 149 ms11 > test vault ... ok 60 ms12 > test wal2json ... ok 50 ms13 > test z_15_ext_interface ... ok 1439 ms14 > test z_15_intarray_ltree_query ... ok 16 ms15 > test z_15_pg_stat_monitor ... ok 16 ms16 > test z_15_pgjwt ... ok 31 ms17 > test z_15_pgvector ... ok 92 ms18 > test z_15_plv8 ... ok 86 ms19 > test z_15_roles ... ok 24 ms20 > test z_15_rum ... ok 39 ms21 > test z_15_timescale ... ok 57 ms22 > test z_15_unhype_timescale_to_partman ... ok 19985 ms23 >24 > =======================25 > 1 of 73 tests failed.26 > =======================27 >28 > The differences that caused some tests to fail can be viewed in the29 > file "/nix/store/bv4a5zax4z0x0zx4fbxvq4lgw5lc64df-run-check-harness-psql-15-slim/regression_output/regression.diffs". A copy of the test summary that you see30 > above is saved in the file "/nix/store/bv4a5zax4z0x0zx4fbxvq4lgw5lc64df-run-check-harness-psql-15-slim/regression_output/regression.out".31 >32 > 2026-10-26 08:30:06 [ERROR] pg_regress tests failed33 > 2026-10-26 08:30:06 [ERROR] An error occurred. Exit code: 134 > 2026-10-26 08:30:06 [ERROR] Debug logs:35 For full logs, run:36 nix log /nix/store/4ppyn86vw7llp287hbxi78717jarqzp4-run-check-harness-psql-15-slim.drv37error: Cannot build '/nix/store/4ppyn86vw7llp287hbxi78717jarqzp4-run-check-harness-psql-15-slim.drv'.38 Reason: builder failed with exit code 1.39 Output paths:40 /nix/store/bv4a5zax4z0x0zx4fbxvq4lgw5lc64df-run-check-harness-psql-15-slim