setup
checks.aarch64-linux.psql_15
· build #405
· raw
1these 3 derivations will be built:2 /nix/store/hjm5b9frssi7inqpj13yfg6q51v2fnnh-start-postgres-server-test.drv3 /nix/store/rpxx84v8zzz9q8xrypvhsz8zwzhbnr5q-postgres-15-check-harness.drv4 /nix/store/2ial2wyg265jx2my211r7rk26br9bb83-run-check-harness-psql-15.drv5error: build of '/nix/store/2ial2wyg265jx2my211r7rk26br9bb83-run-check-harness-psql-15.drv' on 'ssh-ng://nixbot-remote-build@78.232.36.247' failed: Cannot build '/nix/store/2ial2wyg265jx2my211r7rk26br9bb83-run-check-harness-psql-15.drv'.6 Reason: builder failed with exit code 1.7 Output paths:8 /nix/store/z7h1iz4d9dp4awfx5a15q422692nrgc6-run-check-harness-psql-159 Last 25 log lines:10 > test supautils_restrict_versions ... ok 147 ms11 > test vault ... ok 73 ms12 > test wal2json ... ok 48 ms13 > test z_15_ext_interface ... ok 2407 ms14 > test z_15_intarray_ltree_query ... ok 15 ms15 > test z_15_pg_stat_monitor ... ok 15 ms16 > test z_15_pgjwt ... ok 27 ms17 > test z_15_pgvector ... ok 75 ms18 > test z_15_plv8 ... ok 73 ms19 > test z_15_roles ... ok 23 ms20 > test z_15_rum ... ok 42 ms21 > test z_15_timescale ... ok 48 ms22 > test z_15_unhype_timescale_to_partman ... ok 19212 ms23 >24 > =======================25 > 1 of 73 tests failed.26 > =======================27 >28 > The differences that caused some tests to fail can be viewed in the29 > file "/nix/store/z7h1iz4d9dp4awfx5a15q422692nrgc6-run-check-harness-psql-15/regression_output/regression.diffs". A copy of the test summary that you see30 > above is saved in the file "/nix/store/z7h1iz4d9dp4awfx5a15q422692nrgc6-run-check-harness-psql-15/regression_output/regression.out".31 >32 > 2026-10-21 01:51:09 [ERROR] pg_regress tests failed33 > 2026-10-21 01:51:09 [ERROR] An error occurred. Exit code: 134 > 2026-10-21 01:51:09 [ERROR] Debug logs:35 For full logs, run:36 nix log /nix/store/2ial2wyg265jx2my211r7rk26br9bb83-run-check-harness-psql-15.drv37error: Cannot build '/nix/store/2ial2wyg265jx2my211r7rk26br9bb83-run-check-harness-psql-15.drv'.38 Reason: builder failed with exit code 1.39 Output paths:40 /nix/store/z7h1iz4d9dp4awfx5a15q422692nrgc6-run-check-harness-psql-15