nixbot

builds
1these 3 derivations will be built:2 /nix/store/w5wbmqx66k7xh79d42r64216gdcqp3x4-start-postgres-server-test.drv3 /nix/store/4bkds1kwz868x1qzzzg6g8zy7dz30dsr-postgres-17-check-harness.drv4 /nix/store/6lpds3hz7bwc2q9nxsjqpa970ziz435b-run-check-harness-psql-17-slim.drv5error: Cannot build '/nix/store/6lpds3hz7bwc2q9nxsjqpa970ziz435b-run-check-harness-psql-17-slim.drv'.6 Reason: builder failed with exit code 1.7 Output paths:8 /nix/store/z7r0r5ay9r0bm8cdkcgpdbdm17l8lz0j-run-check-harness-psql-17-slim9 Last 25 log lines:10 > test roles ... ok 10 ms11 > test security ... ok 9 ms12 > test storage ... ok 12 ms13 > test supautils_reserved_roles ... ok 7 ms14 > test supautils_restrict_versions ... ok 73 ms15 > test vault ... ok 24 ms16 > test wal2json ... ok 13 ms17 > test z_17_ext_interface ... FAILED 113 ms18 > test z_17_intarray_ltree_query ... ok 13 ms19 > test z_17_pg_stat_monitor ... ok 6 ms20 > test z_17_pgvector ... ok 11 ms21 > test z_17_roles ... ok 13 ms22 > test z_17_rum ... ok 12 ms23 >24 > =======================25 > 2 of 67 tests failed.26 > =======================27 >28 > The differences that caused some tests to fail can be viewed in the29 > file "/nix/store/z7r0r5ay9r0bm8cdkcgpdbdm17l8lz0j-run-check-harness-psql-17-slim/regression_output/regression.diffs". A copy of the test summary that you see30 > above is saved in the file "/nix/store/z7r0r5ay9r0bm8cdkcgpdbdm17l8lz0j-run-check-harness-psql-17-slim/regression_output/regression.out".31 >32 > 2026-10-05 10:41:35 [ERROR] pg_regress tests failed33 > 2026-10-05 10:41:35 [ERROR] An error occurred. Exit code: 134 > 2026-10-05 10:41:35 [ERROR] Debug logs:35 For full logs, run:36 nix log /nix/store/6lpds3hz7bwc2q9nxsjqpa970ziz435b-run-check-harness-psql-17-slim.drv