setup
checks.x86_64-linux.psql_17
· build #37
· raw
1these 3 derivations will be built:2 /nix/store/15lqmfy566dy68pn80zl2d6yllk30lxm-start-postgres-server-test.drv3 /nix/store/cnmgikqzqz0ids3ikxi4znvl9w77xf2z-postgres-17-check-harness.drv4 /nix/store/88rl5h92jzd6pw32ki3729gz7w5h5ad7-run-check-harness-psql-17.drv5error: Cannot build '/nix/store/88rl5h92jzd6pw32ki3729gz7w5h5ad7-run-check-harness-psql-17.drv'.6 Reason: builder failed with exit code 1.7 Output paths:8 /nix/store/2xyblk0grcic0dz8hazx2lgv81dl1bgg-run-check-harness-psql-179 Last 25 log lines:10 > test roles ... ok 11 ms11 > test security ... ok 11 ms12 > test storage ... ok 13 ms13 > test supautils_reserved_roles ... ok 7 ms14 > test supautils_restrict_versions ... ok 74 ms15 > test vault ... ok 27 ms16 > test wal2json ... ok 13 ms17 > test z_17_ext_interface ... FAILED 138 ms18 > test z_17_intarray_ltree_query ... ok 15 ms19 > test z_17_pg_stat_monitor ... ok 7 ms20 > test z_17_pgvector ... ok 12 ms21 > test z_17_roles ... ok 14 ms22 > test z_17_rum ... ok 13 ms23 >24 > =======================25 > 2 of 67 tests failed.26 > =======================27 >28 > The differences that caused some tests to fail can be viewed in the29 > file "/nix/store/2xyblk0grcic0dz8hazx2lgv81dl1bgg-run-check-harness-psql-17/regression_output/regression.diffs". A copy of the test summary that you see30 > above is saved in the file "/nix/store/2xyblk0grcic0dz8hazx2lgv81dl1bgg-run-check-harness-psql-17/regression_output/regression.out".31 >32 > 2026-10-05 10:58:04 [ERROR] pg_regress tests failed33 > 2026-10-05 10:58:04 [ERROR] An error occurred. Exit code: 134 > 2026-10-05 10:58:04 [ERROR] Debug logs:35 For full logs, run:36 nix log /nix/store/88rl5h92jzd6pw32ki3729gz7w5h5ad7-run-check-harness-psql-17.drv