setup
checks.aarch64-linux.psql_17_slim
· build #37
· raw
1these 3 derivations will be built:2 /nix/store/99snj80fbv4mjf4bk7vqjv2c9skn9jp4-start-postgres-server-test.drv3 /nix/store/b1k7363nramk9an1r6ghl2a7n7rr0q45-postgres-17-check-harness.drv4 /nix/store/wjgsigxh66wgf8mmpg37b1jay3ixwq5y-run-check-harness-psql-17-slim.drv5error: build of '/nix/store/wjgsigxh66wgf8mmpg37b1jay3ixwq5y-run-check-harness-psql-17-slim.drv' on 'ssh-ng://nixbot-remote-build@78.232.36.247' failed: Cannot build '/nix/store/wjgsigxh66wgf8mmpg37b1jay3ixwq5y-run-check-harness-psql-17-slim.drv'.6 Reason: builder failed with exit code 1.7 Output paths:8 /nix/store/zsimyvcw1crplazw5pja6llpnfihmg4d-run-check-harness-psql-17-slim9 Last 25 log lines:10 > test roles ... ok 18 ms11 > test security ... ok 13 ms12 > test storage ... ok 24 ms13 > test supautils_reserved_roles ... ok 10 ms14 > test supautils_restrict_versions ... ok 131 ms15 > test vault ... ok 57 ms16 > test wal2json ... ok 132 ms17 > test z_17_ext_interface ... FAILED 152 ms18 > test z_17_intarray_ltree_query ... ok 17 ms19 > test z_17_pg_stat_monitor ... ok 9 ms20 > test z_17_pgvector ... ok 24 ms21 > test z_17_roles ... ok 19 ms22 > test z_17_rum ... ok 25 ms23 >24 > =======================25 > 2 of 67 tests failed.26 > =======================27 >28 > The differences that caused some tests to fail can be viewed in the29 > file "/nix/store/zsimyvcw1crplazw5pja6llpnfihmg4d-run-check-harness-psql-17-slim/regression_output/regression.diffs". A copy of the test summary that you see30 > above is saved in the file "/nix/store/zsimyvcw1crplazw5pja6llpnfihmg4d-run-check-harness-psql-17-slim/regression_output/regression.out".31 >32 > 2026-10-05 10:39:44 [ERROR] pg_regress tests failed33 > 2026-10-05 10:39:44 [ERROR] An error occurred. Exit code: 134 > 2026-10-05 10:39:44 [ERROR] Debug logs:35 For full logs, run:36 nix log /nix/store/wjgsigxh66wgf8mmpg37b1jay3ixwq5y-run-check-harness-psql-17-slim.drv37error: Cannot build '/nix/store/wjgsigxh66wgf8mmpg37b1jay3ixwq5y-run-check-harness-psql-17-slim.drv'.38 Reason: builder failed with exit code 1.39 Output paths:40 /nix/store/zsimyvcw1crplazw5pja6llpnfihmg4d-run-check-harness-psql-17-slim