setup
checks.aarch64-darwin.psql_17_slim
· build #37
· raw
1these 3 derivations will be built:2 /nix/store/f3mav9ib1nwa70l1gz5vnhq30vkq56y1-start-postgres-server-test.drv3 /nix/store/1g0fk3kzy0s80rlxsdwyp62l0zdbxy3h-postgres-17-check-harness.drv4 /nix/store/k5b385zfli1gw9jkyndq1r1k9ggf85sm-run-check-harness-psql-17-slim.drv5error: build of '/nix/store/k5b385zfli1gw9jkyndq1r1k9ggf85sm-run-check-harness-psql-17-slim.drv' on 'ssh-ng://nixbot-remote-build@62.210.193.142' failed: Cannot build '/nix/store/k5b385zfli1gw9jkyndq1r1k9ggf85sm-run-check-harness-psql-17-slim.drv'.6 Reason: builder failed with exit code 1.7 Output paths:8 /nix/store/s18nvgix33djv22sdsb1b2pmy3k5kl7x-run-check-harness-psql-17-slim9 Last 25 log lines:10 > test roles ... ok 39 ms11 > test security ... ok 30 ms12 > test storage ... ok 38 ms13 > test supautils_reserved_roles ... ok 47 ms14 > test supautils_restrict_versions ... ok 110 ms15 > test vault ... ok 49 ms16 > test wal2json ... ok 39 ms17 > test z_17_ext_interface ... FAILED 124 ms18 > test z_17_intarray_ltree_query ... ok 41 ms19 > test z_17_pg_stat_monitor ... ok 33 ms20 > test z_17_pgvector ... ok 43 ms21 > test z_17_roles ... ok 39 ms22 > test z_17_rum ... ok 44 ms23 >24 > =======================25 > 2 of 67 tests failed.26 > =======================27 >28 > The differences that caused some tests to fail can be viewed in the29 > file "/nix/store/s18nvgix33djv22sdsb1b2pmy3k5kl7x-run-check-harness-psql-17-slim/regression_output/regression.diffs". A copy of the test summary that you see30 > above is saved in the file "/nix/store/s18nvgix33djv22sdsb1b2pmy3k5kl7x-run-check-harness-psql-17-slim/regression_output/regression.out".31 >32 > 2026-10-05 10:37:16 [ERROR] pg_regress tests failed33 > 2026-10-05 10:37:16 [ERROR] An error occurred. Exit code: 134 > 2026-10-05 10:37:16 [ERROR] Debug logs:35 For full logs, run:36 nix log /nix/store/k5b385zfli1gw9jkyndq1r1k9ggf85sm-run-check-harness-psql-17-slim.drv37error: Cannot build '/nix/store/k5b385zfli1gw9jkyndq1r1k9ggf85sm-run-check-harness-psql-17-slim.drv'.38 Reason: builder failed with exit code 1.39 Output paths:40 /nix/store/s18nvgix33djv22sdsb1b2pmy3k5kl7x-run-check-harness-psql-17-slim