setup
checks.aarch64-darwin.psql_17
· build #37
· raw
1these 3 derivations will be built:2 /nix/store/9a4fmgfn2a780flxzbjflwcz6knqn3iq-start-postgres-server-test.drv3 /nix/store/81rarmjhd0j1bv1qs5nm32z5kh6bmdkn-postgres-17-check-harness.drv4 /nix/store/ms23slpgvz54z8x8bz5kxskmjmyvdcrd-run-check-harness-psql-17.drv5error: build of '/nix/store/ms23slpgvz54z8x8bz5kxskmjmyvdcrd-run-check-harness-psql-17.drv' on 'ssh-ng://nixbot-remote-build@62.210.193.142' failed: Cannot build '/nix/store/ms23slpgvz54z8x8bz5kxskmjmyvdcrd-run-check-harness-psql-17.drv'.6 Reason: builder failed with exit code 1.7 Output paths:8 /nix/store/2n5nqavmq2ryy18w8hwwl1iqivrgp3mi-run-check-harness-psql-179 Last 25 log lines:10 > test roles ... ok 37 ms11 > test security ... ok 44 ms12 > test storage ... ok 44 ms13 > test supautils_reserved_roles ... ok 39 ms14 > test supautils_restrict_versions ... ok 96 ms15 > test vault ... ok 66 ms16 > test wal2json ... ok 42 ms17 > test z_17_ext_interface ... FAILED 119 ms18 > test z_17_intarray_ltree_query ... ok 32 ms19 > test z_17_pg_stat_monitor ... ok 27 ms20 > test z_17_pgvector ... ok 35 ms21 > test z_17_roles ... ok 37 ms22 > test z_17_rum ... ok 40 ms23 >24 > =======================25 > 3 of 67 tests failed.26 > =======================27 >28 > The differences that caused some tests to fail can be viewed in the29 > file "/nix/store/2n5nqavmq2ryy18w8hwwl1iqivrgp3mi-run-check-harness-psql-17/regression_output/regression.diffs". A copy of the test summary that you see30 > above is saved in the file "/nix/store/2n5nqavmq2ryy18w8hwwl1iqivrgp3mi-run-check-harness-psql-17/regression_output/regression.out".31 >32 > 2026-10-05 10:36:42 [ERROR] pg_regress tests failed33 > 2026-10-05 10:36:42 [ERROR] An error occurred. Exit code: 134 > 2026-10-05 10:36:42 [ERROR] Debug logs:35 For full logs, run:36 nix log /nix/store/ms23slpgvz54z8x8bz5kxskmjmyvdcrd-run-check-harness-psql-17.drv37error: Cannot build '/nix/store/ms23slpgvz54z8x8bz5kxskmjmyvdcrd-run-check-harness-psql-17.drv'.38 Reason: builder failed with exit code 1.39 Output paths:40 /nix/store/2n5nqavmq2ryy18w8hwwl1iqivrgp3mi-run-check-harness-psql-17