setup
checks.aarch64-darwin.psql_15
· build #37
· raw
1these 3 derivations will be built:2 /nix/store/16dmnx18b7r32rwa2nszk3afh4h95jv9-start-postgres-server-test.drv3 /nix/store/nlwrpx3ds3na36wbzlhvyvzd1y0y1f98-postgres-15-check-harness.drv4 /nix/store/asj2m6qlrw1h5qgl5s08wygaqya0p5b6-run-check-harness-psql-15.drv5error: build of '/nix/store/asj2m6qlrw1h5qgl5s08wygaqya0p5b6-run-check-harness-psql-15.drv' on 'ssh-ng://nixbot-remote-build@62.210.193.142' failed: Cannot build '/nix/store/asj2m6qlrw1h5qgl5s08wygaqya0p5b6-run-check-harness-psql-15.drv'.6 Reason: builder failed with exit code 1.7 Output paths:8 /nix/store/53ifnqhlfprzkhhdwj37r2h8qf9kq1rn-run-check-harness-psql-159 Last 25 log lines:10 > test supautils_restrict_versions ... ok 79 ms11 > test vault ... ok 48 ms12 > test wal2json ... ok 36 ms13 > test z_15_ext_interface ... FAILED 782 ms14 > test z_15_intarray_ltree_query ... ok 30 ms15 > test z_15_pg_stat_monitor ... ok 30 ms16 > test z_15_pgjwt ... ok 38 ms17 > test z_15_pgvector ... ok 55 ms18 > test z_15_plv8 ... ok 393 ms19 > test z_15_roles ... ok 36 ms20 > test z_15_rum ... ok 42 ms21 > test z_15_timescale ... ok 44 ms22 > test z_15_unhype_timescale_to_partman ... ok 9451 ms23 >24 > =======================25 > 3 of 71 tests failed.26 > =======================27 >28 > The differences that caused some tests to fail can be viewed in the29 > file "/nix/store/53ifnqhlfprzkhhdwj37r2h8qf9kq1rn-run-check-harness-psql-15/regression_output/regression.diffs". A copy of the test summary that you see30 > above is saved in the file "/nix/store/53ifnqhlfprzkhhdwj37r2h8qf9kq1rn-run-check-harness-psql-15/regression_output/regression.out".31 >32 > 2026-10-05 10:38:07 [ERROR] pg_regress tests failed33 > 2026-10-05 10:38:07 [ERROR] An error occurred. Exit code: 134 > 2026-10-05 10:38:07 [ERROR] Debug logs:35 For full logs, run:36 nix log /nix/store/asj2m6qlrw1h5qgl5s08wygaqya0p5b6-run-check-harness-psql-15.drv37error: Cannot build '/nix/store/asj2m6qlrw1h5qgl5s08wygaqya0p5b6-run-check-harness-psql-15.drv'.38 Reason: builder failed with exit code 1.39 Output paths:40 /nix/store/53ifnqhlfprzkhhdwj37r2h8qf9kq1rn-run-check-harness-psql-15