setup
checks.x86_64-linux.psql_17
· build #327
· raw
1this derivation will be built:2 /nix/store/40rzh8v3yqvbiljp54pf2pgxnnn19z7x-run-check-harness-psql-17.drv3this path will be fetched (4.5 KiB download, 16.1 KiB unpacked):4 /nix/store/jglzrv71yrqs9q6haqln4xv0hwvwdij7-postgres-17-check-harness5error: Cannot build '/nix/store/40rzh8v3yqvbiljp54pf2pgxnnn19z7x-run-check-harness-psql-17.drv'.6 Reason: builder failed with exit code 1.7 Output paths:8 /nix/store/1md77ybihpysk5pqfrgysf9zvn8dpwg3-run-check-harness-psql-179 Last 25 log lines:10 > test roles ... FAILED 15 ms11 > test security ... ok 12 ms12 > test storage ... ok 16 ms13 > test supautils_reserved_roles ... ok 11 ms14 > test supautils_restrict_versions ... ok 107 ms15 > test vault ... ok 46 ms16 > test wal2json ... ok 63 ms17 > test z_17_ext_interface ... ok 142 ms18 > test z_17_intarray_ltree_query ... ok 13 ms19 > test z_17_pg_stat_monitor ... ok 7 ms20 > test z_17_pgvector ... ok 14 ms21 > test z_17_roles ... ok 17 ms22 > test z_17_rum ... ok 18 ms23 >24 > =======================25 > 1 of 68 tests failed.26 > =======================27 >28 > The differences that caused some tests to fail can be viewed in the29 > file "/nix/store/1md77ybihpysk5pqfrgysf9zvn8dpwg3-run-check-harness-psql-17/regression_output/regression.diffs". A copy of the test summary that you see30 > above is saved in the file "/nix/store/1md77ybihpysk5pqfrgysf9zvn8dpwg3-run-check-harness-psql-17/regression_output/regression.out".31 >32 > 2026-10-10 14:44:03 [ERROR] pg_regress tests failed33 > 2026-10-10 14:44:03 [ERROR] An error occurred. Exit code: 134 > 2026-10-10 14:44:04 [ERROR] Debug logs:35 For full logs, run:36 nix log /nix/store/40rzh8v3yqvbiljp54pf2pgxnnn19z7x-run-check-harness-psql-17.drv