setup
checks.x86_64-linux.psql_15
· build #327
· raw
1this derivation will be built:2 /nix/store/33shgpkqrb0yyjnqfny5ixjkraqcwcpv-run-check-harness-psql-15.drv3this path will be fetched (4.5 KiB download, 16.2 KiB unpacked):4 /nix/store/44fdhb0lv0lwcg6g1r7p4a2fqdfqi6c7-postgres-15-check-harness5error: Cannot build '/nix/store/33shgpkqrb0yyjnqfny5ixjkraqcwcpv-run-check-harness-psql-15.drv'.6 Reason: builder failed with exit code 1.7 Output paths:8 /nix/store/k9jh8ns0yq2vgbpdaf2c0hy4ykx6wzhm-run-check-harness-psql-159 Last 25 log lines:10 > test supautils_restrict_versions ... ok 84 ms11 > test vault ... ok 30 ms12 > test wal2json ... ok 16 ms13 > test z_15_ext_interface ... ok 632 ms14 > test z_15_intarray_ltree_query ... ok 11 ms15 > test z_15_pg_stat_monitor ... ok 11 ms16 > test z_15_pgjwt ... ok 19 ms17 > test z_15_pgvector ... ok 32 ms18 > test z_15_plv8 ... ok 48 ms19 > test z_15_roles ... ok 19 ms20 > test z_15_rum ... ok 18 ms21 > test z_15_timescale ... ok 24 ms22 > test z_15_unhype_timescale_to_partman ... ok 12131 ms23 >24 > =======================25 > 1 of 72 tests failed.26 > =======================27 >28 > The differences that caused some tests to fail can be viewed in the29 > file "/nix/store/k9jh8ns0yq2vgbpdaf2c0hy4ykx6wzhm-run-check-harness-psql-15/regression_output/regression.diffs". A copy of the test summary that you see30 > above is saved in the file "/nix/store/k9jh8ns0yq2vgbpdaf2c0hy4ykx6wzhm-run-check-harness-psql-15/regression_output/regression.out".31 >32 > 2026-10-10 14:44:44 [ERROR] pg_regress tests failed33 > 2026-10-10 14:44:44 [ERROR] An error occurred. Exit code: 134 > 2026-10-10 14:44:44 [ERROR] Debug logs:35 For full logs, run:36 nix log /nix/store/33shgpkqrb0yyjnqfny5ixjkraqcwcpv-run-check-harness-psql-15.drv