setup
checks.aarch64-linux.psql_17
· build #327
· raw
1these 2 derivations will be built:2 /nix/store/wmdl63g92yxx5g2prcdyrnh8ayizrf2w-postgres-17-check-harness.drv3 /nix/store/2s4y63821gawlp0qim21gvdny5k5djar-run-check-harness-psql-17.drv4error: build of '/nix/store/2s4y63821gawlp0qim21gvdny5k5djar-run-check-harness-psql-17.drv' on 'ssh-ng://nixbot-remote-build@78.232.36.247' failed: Cannot build '/nix/store/2s4y63821gawlp0qim21gvdny5k5djar-run-check-harness-psql-17.drv'.5 Reason: builder failed with exit code 1.6 Output paths:7 /nix/store/zasgs560vz4jsi2kz4sgkd8raw222yy2-run-check-harness-psql-178 Last 25 log lines:9 > test roles ... FAILED 19 ms10 > test security ... ok 15 ms11 > test storage ... ok 27 ms12 > test supautils_reserved_roles ... ok 11 ms13 > test supautils_restrict_versions ... ok 148 ms14 > test vault ... ok 47 ms15 > test wal2json ... ok 52 ms16 > test z_17_ext_interface ... ok 158 ms17 > test z_17_intarray_ltree_query ... ok 19 ms18 > test z_17_pg_stat_monitor ... ok 10 ms19 > test z_17_pgvector ... ok 25 ms20 > test z_17_roles ... ok 22 ms21 > test z_17_rum ... ok 27 ms22 >23 > =======================24 > 1 of 68 tests failed.25 > =======================26 >27 > The differences that caused some tests to fail can be viewed in the28 > file "/nix/store/zasgs560vz4jsi2kz4sgkd8raw222yy2-run-check-harness-psql-17/regression_output/regression.diffs". A copy of the test summary that you see29 > above is saved in the file "/nix/store/zasgs560vz4jsi2kz4sgkd8raw222yy2-run-check-harness-psql-17/regression_output/regression.out".30 >31 > 2026-10-10 14:41:26 [ERROR] pg_regress tests failed32 > 2026-10-10 14:41:26 [ERROR] An error occurred. Exit code: 133 > 2026-10-10 14:41:26 [ERROR] Debug logs:34 For full logs, run:35 nix log /nix/store/2s4y63821gawlp0qim21gvdny5k5djar-run-check-harness-psql-17.drv36error: Cannot build '/nix/store/2s4y63821gawlp0qim21gvdny5k5djar-run-check-harness-psql-17.drv'.37 Reason: builder failed with exit code 1.38 Output paths:39 /nix/store/zasgs560vz4jsi2kz4sgkd8raw222yy2-run-check-harness-psql-17