nixbot

builds
1this derivation will be built:2 /nix/store/ra5ff0cysbcpcjl3myhix42kbgybq0bm-run-check-harness-psql-17-slim.drv3these 2 paths will be fetched (23.0 KiB download, 91.0 KiB unpacked):4 /nix/store/k13v03yjdg75yyjas28gm2jv5myshgx9-postgres-17-check-harness5 /nix/store/58d50hhfdzjdfadm6divx9dmrgc8g5ds-start-postgres-server-test6error: Cannot build '/nix/store/ra5ff0cysbcpcjl3myhix42kbgybq0bm-run-check-harness-psql-17-slim.drv'.7 Reason: builder failed with exit code 1.8 Output paths:9 /nix/store/ia2lnl7ylvaga9lrwgjwsfshzr7vri7z-run-check-harness-psql-17-slim10 Last 25 log lines:11 > test roles ... FAILED 13 ms12 > test security ... ok 10 ms13 > test storage ... ok 14 ms14 > test supautils_reserved_roles ... ok 8 ms15 > test supautils_restrict_versions ... ok 82 ms16 > test vault ... ok 26 ms17 > test wal2json ... ok 15 ms18 > test z_17_ext_interface ... ok 115 ms19 > test z_17_intarray_ltree_query ... ok 12 ms20 > test z_17_pg_stat_monitor ... ok 7 ms21 > test z_17_pgvector ... ok 13 ms22 > test z_17_roles ... ok 14 ms23 > test z_17_rum ... ok 13 ms24 >25 > =======================26 > 1 of 68 tests failed.27 > =======================28 >29 > The differences that caused some tests to fail can be viewed in the30 > file "/nix/store/ia2lnl7ylvaga9lrwgjwsfshzr7vri7z-run-check-harness-psql-17-slim/regression_output/regression.diffs". A copy of the test summary that you see31 > above is saved in the file "/nix/store/ia2lnl7ylvaga9lrwgjwsfshzr7vri7z-run-check-harness-psql-17-slim/regression_output/regression.out".32 >33 > 2026-10-10 11:10:12 [ERROR] pg_regress tests failed34 > 2026-10-10 11:10:12 [ERROR] An error occurred. Exit code: 135 > 2026-10-10 11:10:12 [ERROR] Debug logs:36 For full logs, run:37 nix log /nix/store/ra5ff0cysbcpcjl3myhix42kbgybq0bm-run-check-harness-psql-17-slim.drv