nixbot

builds
1this derivation will be built:2 /nix/store/4ny8d9gcqhf5h3zv4rr79qi6kyl54wb4-run-check-harness-psql-15.drv3these 2 paths will be fetched (23.0 KiB download, 91.1 KiB unpacked):4 /nix/store/2izdvqqr7a14kwcp2w2dvc761j5ivp4w-postgres-15-check-harness5 /nix/store/n6nksh5kh70wvfx3arhf2wp89dm2d3lx-start-postgres-server-test6error: Cannot build '/nix/store/4ny8d9gcqhf5h3zv4rr79qi6kyl54wb4-run-check-harness-psql-15.drv'.7 Reason: builder failed with exit code 1.8 Output paths:9 /nix/store/smz60l5h3ywag7isg0n29w20d9h1w11d-run-check-harness-psql-1510 Last 25 log lines:11 > test supautils_restrict_versions ... ok 81 ms12 > test vault ... ok 28 ms13 > test wal2json ... ok 13 ms14 > test z_15_ext_interface ... ok 632 ms15 > test z_15_intarray_ltree_query ... ok 12 ms16 > test z_15_pg_stat_monitor ... ok 11 ms17 > test z_15_pgjwt ... ok 19 ms18 > test z_15_pgvector ... ok 32 ms19 > test z_15_plv8 ... ok 48 ms20 > test z_15_roles ... ok 18 ms21 > test z_15_rum ... ok 17 ms22 > test z_15_timescale ... ok 21 ms23 > test z_15_unhype_timescale_to_partman ... ok 11724 ms24 >25 > =======================26 > 1 of 72 tests failed.27 > =======================28 >29 > The differences that caused some tests to fail can be viewed in the30 > file "/nix/store/smz60l5h3ywag7isg0n29w20d9h1w11d-run-check-harness-psql-15/regression_output/regression.diffs". A copy of the test summary that you see31 > above is saved in the file "/nix/store/smz60l5h3ywag7isg0n29w20d9h1w11d-run-check-harness-psql-15/regression_output/regression.out".32 >33 > 2026-10-10 11:10:37 [ERROR] pg_regress tests failed34 > 2026-10-10 11:10:37 [ERROR] An error occurred. Exit code: 135 > 2026-10-10 11:10:37 [ERROR] Debug logs:36 For full logs, run:37 nix log /nix/store/4ny8d9gcqhf5h3zv4rr79qi6kyl54wb4-run-check-harness-psql-15.drv