setup
checks.aarch64-linux.psql_17_slim
· build #325
· raw
1this derivation will be built:2 /nix/store/6yp0w96iiyyhw7irvfh2s99mp0nm55yg-run-check-harness-psql-17-slim.drv3these 2 paths will be fetched (23.0 KiB download, 91.0 KiB unpacked):4 /nix/store/5m40yddwgby6ihgcp6424kj79zp73k0h-postgres-17-check-harness5 /nix/store/ylcqaknlvzslj6bwzvqkdjbsnnd5vq3k-start-postgres-server-test6error: build of '/nix/store/6yp0w96iiyyhw7irvfh2s99mp0nm55yg-run-check-harness-psql-17-slim.drv' on 'ssh-ng://nixbot-remote-build@78.232.36.247' failed: Cannot build '/nix/store/6yp0w96iiyyhw7irvfh2s99mp0nm55yg-run-check-harness-psql-17-slim.drv'.7 Reason: builder failed with exit code 1.8 Output paths:9 /nix/store/z0k9p4w7al1wz4pr0w3fdnlmwysqsnyg-run-check-harness-psql-17-slim10 Last 25 log lines:11 > test roles ... FAILED 19 ms12 > test security ... ok 14 ms13 > test storage ... ok 28 ms14 > test supautils_reserved_roles ... ok 11 ms15 > test supautils_restrict_versions ... ok 143 ms16 > test vault ... ok 49 ms17 > test wal2json ... ok 43 ms18 > test z_17_ext_interface ... ok 156 ms19 > test z_17_intarray_ltree_query ... ok 18 ms20 > test z_17_pg_stat_monitor ... ok 10 ms21 > test z_17_pgvector ... ok 24 ms22 > test z_17_roles ... ok 21 ms23 > test z_17_rum ... ok 26 ms24 >25 > =======================26 > 1 of 68 tests failed.27 > =======================28 >29 > The differences that caused some tests to fail can be viewed in the30 > file "/nix/store/z0k9p4w7al1wz4pr0w3fdnlmwysqsnyg-run-check-harness-psql-17-slim/regression_output/regression.diffs". A copy of the test summary that you see31 > above is saved in the file "/nix/store/z0k9p4w7al1wz4pr0w3fdnlmwysqsnyg-run-check-harness-psql-17-slim/regression_output/regression.out".32 >33 > 2026-10-10 11:09:01 [ERROR] pg_regress tests failed34 > 2026-10-10 11:09:01 [ERROR] An error occurred. Exit code: 135 > 2026-10-10 11:09:01 [ERROR] Debug logs:36 For full logs, run:37 nix log /nix/store/6yp0w96iiyyhw7irvfh2s99mp0nm55yg-run-check-harness-psql-17-slim.drv38error: Cannot build '/nix/store/6yp0w96iiyyhw7irvfh2s99mp0nm55yg-run-check-harness-psql-17-slim.drv'.39 Reason: builder failed with exit code 1.40 Output paths:41 /nix/store/z0k9p4w7al1wz4pr0w3fdnlmwysqsnyg-run-check-harness-psql-17-slim