setup
checks.aarch64-linux.psql_17
· build #325
· raw
1this derivation will be built:2 /nix/store/7jlyd22jacljnd9lsnmxssh68gbc14v5-run-check-harness-psql-17.drv3these 2 paths will be fetched (23.0 KiB download, 91.0 KiB unpacked):4 /nix/store/d3hmywxsbi2xdh1rk7sy9pkcqcvb0q45-postgres-17-check-harness5 /nix/store/axzc1fgcckzrbbln7w0za5whqjmyhyx5-start-postgres-server-test6error: build of '/nix/store/7jlyd22jacljnd9lsnmxssh68gbc14v5-run-check-harness-psql-17.drv' on 'ssh-ng://nixbot-remote-build@78.232.36.247' failed: Cannot build '/nix/store/7jlyd22jacljnd9lsnmxssh68gbc14v5-run-check-harness-psql-17.drv'.7 Reason: builder failed with exit code 1.8 Output paths:9 /nix/store/q0l6ynvzmbn0m83r45w9g9hfniy9vgsb-run-check-harness-psql-1710 Last 25 log lines:11 > test roles ... FAILED 19 ms12 > test security ... ok 14 ms13 > test storage ... ok 27 ms14 > test supautils_reserved_roles ... ok 11 ms15 > test supautils_restrict_versions ... ok 142 ms16 > test vault ... ok 46 ms17 > test wal2json ... ok 42 ms18 > test z_17_ext_interface ... ok 158 ms19 > test z_17_intarray_ltree_query ... ok 19 ms20 > test z_17_pg_stat_monitor ... ok 9 ms21 > test z_17_pgvector ... ok 24 ms22 > test z_17_roles ... ok 22 ms23 > test z_17_rum ... ok 29 ms24 >25 > =======================26 > 1 of 68 tests failed.27 > =======================28 >29 > The differences that caused some tests to fail can be viewed in the30 > file "/nix/store/q0l6ynvzmbn0m83r45w9g9hfniy9vgsb-run-check-harness-psql-17/regression_output/regression.diffs". A copy of the test summary that you see31 > above is saved in the file "/nix/store/q0l6ynvzmbn0m83r45w9g9hfniy9vgsb-run-check-harness-psql-17/regression_output/regression.out".32 >33 > 2026-10-10 11:04:11 [ERROR] pg_regress tests failed34 > 2026-10-10 11:04:11 [ERROR] An error occurred. Exit code: 135 > 2026-10-10 11:04:11 [ERROR] Debug logs:36 For full logs, run:37 nix log /nix/store/7jlyd22jacljnd9lsnmxssh68gbc14v5-run-check-harness-psql-17.drv38error: Cannot build '/nix/store/7jlyd22jacljnd9lsnmxssh68gbc14v5-run-check-harness-psql-17.drv'.39 Reason: builder failed with exit code 1.40 Output paths:41 /nix/store/q0l6ynvzmbn0m83r45w9g9hfniy9vgsb-run-check-harness-psql-17