setup
checks.aarch64-linux.psql_15_slim
· build #325
· raw
1this derivation will be built:2 /nix/store/wmn6xm3hps5jk6h6mf3fn39sn21py68d-run-check-harness-psql-15-slim.drv3these 2 paths will be fetched (23.0 KiB download, 91.1 KiB unpacked):4 /nix/store/854n6rngnwnpg0aznwswsnz1cprrml7h-postgres-15-check-harness5 /nix/store/rysdkdrrvgkiw5gyac64vfz0ylfm4zf8-start-postgres-server-test6error: build of '/nix/store/wmn6xm3hps5jk6h6mf3fn39sn21py68d-run-check-harness-psql-15-slim.drv' on 'ssh-ng://nixbot-remote-build@78.232.36.247' failed: Cannot build '/nix/store/wmn6xm3hps5jk6h6mf3fn39sn21py68d-run-check-harness-psql-15-slim.drv'.7 Reason: builder failed with exit code 1.8 Output paths:9 /nix/store/8q1bpq794ivdwszc49wh92mg3z58x2nh-run-check-harness-psql-15-slim10 Last 25 log lines:11 > test supautils_restrict_versions ... ok 157 ms12 > test vault ... ok 57 ms13 > test wal2json ... ok 52 ms14 > test z_15_ext_interface ... ok 1386 ms15 > test z_15_intarray_ltree_query ... ok 14 ms16 > test z_15_pg_stat_monitor ... ok 15 ms17 > test z_15_pgjwt ... ok 31 ms18 > test z_15_pgvector ... ok 74 ms19 > test z_15_plv8 ... ok 79 ms20 > test z_15_roles ... ok 24 ms21 > test z_15_rum ... ok 37 ms22 > test z_15_timescale ... ok 52 ms23 > test z_15_unhype_timescale_to_partman ... ok 18656 ms24 >25 > =======================26 > 1 of 72 tests failed.27 > =======================28 >29 > The differences that caused some tests to fail can be viewed in the30 > file "/nix/store/8q1bpq794ivdwszc49wh92mg3z58x2nh-run-check-harness-psql-15-slim/regression_output/regression.diffs". A copy of the test summary that you see31 > above is saved in the file "/nix/store/8q1bpq794ivdwszc49wh92mg3z58x2nh-run-check-harness-psql-15-slim/regression_output/regression.out".32 >33 > 2026-10-10 11:06:25 [ERROR] pg_regress tests failed34 > 2026-10-10 11:06:25 [ERROR] An error occurred. Exit code: 135 > 2026-10-10 11:06:25 [ERROR] Debug logs:36 For full logs, run:37 nix log /nix/store/wmn6xm3hps5jk6h6mf3fn39sn21py68d-run-check-harness-psql-15-slim.drv38error: Cannot build '/nix/store/wmn6xm3hps5jk6h6mf3fn39sn21py68d-run-check-harness-psql-15-slim.drv'.39 Reason: builder failed with exit code 1.40 Output paths:41 /nix/store/8q1bpq794ivdwszc49wh92mg3z58x2nh-run-check-harness-psql-15-slim