setup
checks.aarch64-linux.psql_15
· build #325
· raw
1this derivation will be built:2 /nix/store/wxsb072xa3ic2vm77dbk1i47kndsq92s-run-check-harness-psql-15.drv3these 2 paths will be fetched (23.0 KiB download, 91.1 KiB unpacked):4 /nix/store/r2wqg95y59qryjk0c4g9hvjpqkbgrzf5-postgres-15-check-harness5 /nix/store/saqkl2234kf80kh9b3rl7gp3n6qrkwm1-start-postgres-server-test6error: build of '/nix/store/wxsb072xa3ic2vm77dbk1i47kndsq92s-run-check-harness-psql-15.drv' on 'ssh-ng://nixbot-remote-build@78.232.36.247' failed: Cannot build '/nix/store/wxsb072xa3ic2vm77dbk1i47kndsq92s-run-check-harness-psql-15.drv'.7 Reason: builder failed with exit code 1.8 Output paths:9 /nix/store/pyq7ghgnxn4pc26czwpjx50pi25vxp1l-run-check-harness-psql-1510 Last 25 log lines:11 > test supautils_restrict_versions ... ok 153 ms12 > test vault ... ok 55 ms13 > test wal2json ... ok 44 ms14 > test z_15_ext_interface ... ok 1380 ms15 > test z_15_intarray_ltree_query ... ok 15 ms16 > test z_15_pg_stat_monitor ... ok 15 ms17 > test z_15_pgjwt ... ok 30 ms18 > test z_15_pgvector ... ok 78 ms19 > test z_15_plv8 ... ok 78 ms20 > test z_15_roles ... ok 25 ms21 > test z_15_rum ... ok 38 ms22 > test z_15_timescale ... ok 50 ms23 > test z_15_unhype_timescale_to_partman ... ok 18615 ms24 >25 > =======================26 > 1 of 72 tests failed.27 > =======================28 >29 > The differences that caused some tests to fail can be viewed in the30 > file "/nix/store/pyq7ghgnxn4pc26czwpjx50pi25vxp1l-run-check-harness-psql-15/regression_output/regression.diffs". A copy of the test summary that you see31 > above is saved in the file "/nix/store/pyq7ghgnxn4pc26czwpjx50pi25vxp1l-run-check-harness-psql-15/regression_output/regression.out".32 >33 > 2026-10-10 11:07:49 [ERROR] pg_regress tests failed34 > 2026-10-10 11:07:49 [ERROR] An error occurred. Exit code: 135 > 2026-10-10 11:07:49 [ERROR] Debug logs:36 For full logs, run:37 nix log /nix/store/wxsb072xa3ic2vm77dbk1i47kndsq92s-run-check-harness-psql-15.drv38error: Cannot build '/nix/store/wxsb072xa3ic2vm77dbk1i47kndsq92s-run-check-harness-psql-15.drv'.39 Reason: builder failed with exit code 1.40 Output paths:41 /nix/store/pyq7ghgnxn4pc26czwpjx50pi25vxp1l-run-check-harness-psql-15