nixbot

builds
1this derivation will be built:2 /nix/store/cn1ywiyssp3qibrwvnzh3fgrsx5jw4zh-run-check-harness-psql-17-slim.drv3these 2 paths will be fetched (23.2 KiB download, 91.8 KiB unpacked):4 /nix/store/i5xqy97rysqq67b39npsfz1r53fdngxd-postgres-17-check-harness5 /nix/store/ry5kqxxras3z7azxv8glr4ykwlmkdzrn-start-postgres-server-test6error: Cannot build '/nix/store/cn1ywiyssp3qibrwvnzh3fgrsx5jw4zh-run-check-harness-psql-17-slim.drv'.7 Reason: builder failed with exit code 1.8 Output paths:9 /nix/store/nhm3mc0krbp2b04fsjvh7593pafw0pr5-run-check-harness-psql-17-slim10 Last 25 log lines:11 > test roles ... ok 11 ms12 > test security ... ok 14 ms13 > test storage ... ok 19 ms14 > test supautils_reserved_roles ... ok 9 ms15 > test supautils_restrict_versions ... ok 104 ms16 > test vault ... ok 39 ms17 > test wal2json ... ok 17 ms18 > test z_17_ext_interface ... FAILED 134 ms19 > test z_17_intarray_ltree_query ... ok 15 ms20 > test z_17_pg_stat_monitor ... ok 8 ms21 > test z_17_pgvector ... ok 14 ms22 > test z_17_roles ... ok 20 ms23 > test z_17_rum ... ok 19 ms24 >25 > =======================26 > 2 of 68 tests failed.27 > =======================28 >29 > The differences that caused some tests to fail can be viewed in the30 > file "/nix/store/nhm3mc0krbp2b04fsjvh7593pafw0pr5-run-check-harness-psql-17-slim/regression_output/regression.diffs". A copy of the test summary that you see31 > above is saved in the file "/nix/store/nhm3mc0krbp2b04fsjvh7593pafw0pr5-run-check-harness-psql-17-slim/regression_output/regression.out".32 >33 > 2026-10-08 01:08:15 [ERROR] pg_regress tests failed34 > 2026-10-08 01:08:15 [ERROR] An error occurred. Exit code: 135 > 2026-10-08 01:08:15 [ERROR] Debug logs:36 For full logs, run:37 nix log /nix/store/cn1ywiyssp3qibrwvnzh3fgrsx5jw4zh-run-check-harness-psql-17-slim.drv