nixbot

builds
1this derivation will be built:2 /nix/store/jvncc4zck3q2c88facgr111g97iad8xh-run-check-harness-psql-17.drv3these 2 paths will be fetched (23.2 KiB download, 91.8 KiB unpacked):4 /nix/store/z25fgw54wiim8syl95n2l7y15zvbl126-postgres-17-check-harness5 /nix/store/qg2j0s6b1bhj4rnm1ln4clqwqyj16skk-start-postgres-server-test6error: Cannot build '/nix/store/jvncc4zck3q2c88facgr111g97iad8xh-run-check-harness-psql-17.drv'.7 Reason: builder failed with exit code 1.8 Output paths:9 /nix/store/460qcgn7a52x3lvgg94hkd6bsf5r8xzm-run-check-harness-psql-1710 Last 25 log lines:11 > test roles ... ok 17 ms12 > test security ... ok 14 ms13 > test storage ... ok 21 ms14 > test supautils_reserved_roles ... ok 13 ms15 > test supautils_restrict_versions ... ok 104 ms16 > test vault ... ok 37 ms17 > test wal2json ... ok 20 ms18 > test z_17_ext_interface ... FAILED 156 ms19 > test z_17_intarray_ltree_query ... ok 15 ms20 > test z_17_pg_stat_monitor ... ok 10 ms21 > test z_17_pgvector ... ok 19 ms22 > test z_17_roles ... ok 24 ms23 > test z_17_rum ... ok 17 ms24 >25 > =======================26 > 2 of 68 tests failed.27 > =======================28 >29 > The differences that caused some tests to fail can be viewed in the30 > file "/nix/store/460qcgn7a52x3lvgg94hkd6bsf5r8xzm-run-check-harness-psql-17/regression_output/regression.diffs". A copy of the test summary that you see31 > above is saved in the file "/nix/store/460qcgn7a52x3lvgg94hkd6bsf5r8xzm-run-check-harness-psql-17/regression_output/regression.out".32 >33 > 2026-10-08 01:10:25 [ERROR] pg_regress tests failed34 > 2026-10-08 01:10:25 [ERROR] An error occurred. Exit code: 135 > 2026-10-08 01:10:25 [ERROR] Debug logs:36 For full logs, run:37 nix log /nix/store/jvncc4zck3q2c88facgr111g97iad8xh-run-check-harness-psql-17.drv