setup
checks.x86_64-linux.psql_17_slim
· build #172
· raw
1this derivation will be built:2 /nix/store/5h1b1giriyph3rrclxrwhlcd0aa82js6-run-check-harness-psql-17-slim.drv3this path will be fetched (4.5 KiB download, 16.1 KiB unpacked):4 /nix/store/24lwg82g95c1s97sjrn3yj51pwpb8cv6-postgres-17-check-harness5error: Cannot build '/nix/store/5h1b1giriyph3rrclxrwhlcd0aa82js6-run-check-harness-psql-17-slim.drv'.6 Reason: builder failed with exit code 1.7 Output paths:8 /nix/store/p2xkl4v76a8s67nvhdmydxvdii0zc550-run-check-harness-psql-17-slim9 Last 25 log lines:10 > test roles ... ok 15 ms11 > test security ... ok 12 ms12 > test storage ... ok 16 ms13 > test supautils_reserved_roles ... ok 10 ms14 > test supautils_restrict_versions ... ok 108 ms15 > test vault ... ok 31 ms16 > test wal2json ... ok 23 ms17 > test z_17_ext_interface ... FAILED 124 ms18 > test z_17_intarray_ltree_query ... ok 14 ms19 > test z_17_pg_stat_monitor ... ok 7 ms20 > test z_17_pgvector ... ok 13 ms21 > test z_17_roles ... ok 14 ms22 > test z_17_rum ... ok 13 ms23 >24 > =======================25 > 2 of 68 tests failed.26 > =======================27 >28 > The differences that caused some tests to fail can be viewed in the29 > file "/nix/store/p2xkl4v76a8s67nvhdmydxvdii0zc550-run-check-harness-psql-17-slim/regression_output/regression.diffs". A copy of the test summary that you see30 > above is saved in the file "/nix/store/p2xkl4v76a8s67nvhdmydxvdii0zc550-run-check-harness-psql-17-slim/regression_output/regression.out".31 >32 > 2026-10-08 01:11:05 [ERROR] pg_regress tests failed33 > 2026-10-08 01:11:05 [ERROR] An error occurred. Exit code: 134 > 2026-10-08 01:11:05 [ERROR] Debug logs:35 For full logs, run:36 nix log /nix/store/5h1b1giriyph3rrclxrwhlcd0aa82js6-run-check-harness-psql-17-slim.drv