setup
checks.aarch64-linux.psql_17_slim
· build #172
· raw
1these 2 derivations will be built:2 /nix/store/aas1dwmb3jnf01xcf08r8ixvb920s0cp-postgres-17-check-harness.drv3 /nix/store/pf179q0ma4d8lqzpczj9njam4a2797wz-run-check-harness-psql-17-slim.drv4error: build of '/nix/store/pf179q0ma4d8lqzpczj9njam4a2797wz-run-check-harness-psql-17-slim.drv' on 'ssh-ng://nixbot-remote-build@78.232.36.247' failed: Cannot build '/nix/store/pf179q0ma4d8lqzpczj9njam4a2797wz-run-check-harness-psql-17-slim.drv'.5 Reason: builder failed with exit code 1.6 Output paths:7 /nix/store/ghpl1yrrfnwxqjamiwpbb7i5b5lr1v7c-run-check-harness-psql-17-slim8 Last 25 log lines:9 > test roles ... ok 19 ms10 > test security ... ok 15 ms11 > test storage ... ok 36 ms12 > test supautils_reserved_roles ... ok 11 ms13 > test supautils_restrict_versions ... ok 156 ms14 > test vault ... ok 45 ms15 > test wal2json ... ok 72 ms16 > test z_17_ext_interface ... FAILED 154 ms17 > test z_17_intarray_ltree_query ... ok 18 ms18 > test z_17_pg_stat_monitor ... ok 9 ms19 > test z_17_pgvector ... ok 66 ms20 > test z_17_roles ... ok 21 ms21 > test z_17_rum ... ok 27 ms22 >23 > =======================24 > 2 of 68 tests failed.25 > =======================26 >27 > The differences that caused some tests to fail can be viewed in the28 > file "/nix/store/ghpl1yrrfnwxqjamiwpbb7i5b5lr1v7c-run-check-harness-psql-17-slim/regression_output/regression.diffs". A copy of the test summary that you see29 > above is saved in the file "/nix/store/ghpl1yrrfnwxqjamiwpbb7i5b5lr1v7c-run-check-harness-psql-17-slim/regression_output/regression.out".30 >31 > 2026-10-08 01:00:18 [ERROR] pg_regress tests failed32 > 2026-10-08 01:00:18 [ERROR] An error occurred. Exit code: 133 > 2026-10-08 01:00:18 [ERROR] Debug logs:34 For full logs, run:35 nix log /nix/store/pf179q0ma4d8lqzpczj9njam4a2797wz-run-check-harness-psql-17-slim.drv36error: Cannot build '/nix/store/pf179q0ma4d8lqzpczj9njam4a2797wz-run-check-harness-psql-17-slim.drv'.37 Reason: builder failed with exit code 1.38 Output paths:39 /nix/store/ghpl1yrrfnwxqjamiwpbb7i5b5lr1v7c-run-check-harness-psql-17-slim